{"text_format":"3","workbook":"xlsx","n_sheets":12,"sheets":["Budget Sheet Instructions","Demographics","Budget Detail - Year 1","Budget Detail - Year 2","Budget Detail - Year 3","Budget Detail - Year 4","Budget Detail - Year 5","Budget Summary","Admin","Reference Data","Example - Budget Detail Sheet","Definitions"],"not_rendered":{"images":2,"defined_names":615,"comments":5},"read":"whole","date_system":"1900"}

{"sheet":"Budget Sheet Instructions","index":0,"n_rows":34,"n_cols":10,"rows_kept":34,"merged":[[0,0,0,10],[1,0,1,10],[2,0,2,10],[3,0,3,10],[4,0,4,10],[5,0,5,4],[5,6,5,10],[6,0,6,10],[7,0,7,10],[8,0,8,10],[9,0,10,10],[11,0,11,10],[12,2,12,4],[12,6,12,8],[13,1,13,2],[13,3,13,4],[13,5,13,6],[13,7,13,8],[13,9,13,10],[14,0,14,10],[15,0,15,10],[16,0,16,10],[17,0,17,10],[18,0,18,10],[19,0,19,10],[20,0,20,10],[21,0,21,10],[22,0,22,10],[23,0,23,10],[24,0,24,10],[25,1,25,10],[26,1,26,10],[27,1,27,10],[28,1,28,10],[29,1,29,10],[30,1,30,10],[31,1,31,10],[32,1,32,10],[33,1,33,10]]}
["Budget Detail Worksheet\nOMB Approval NO.: 1121-0329\nExpires 11/30/2020"]
["For a 508 compliant, accessible version of the Budget Detail Worksheet, use the following link:"]
["https://ojp.gov/funding/Apply/Forms/BudgetDetailWorksheet/BDW508.pdf"]
["Worksheet Instructions"]
["Note: This document requires macros be enabled to work properly. Please ensure that macros are enabled before entering any data. You may be able to enable macros by choosing the \"Enable this content\" option from the Security Warning Ribbon above. \n\n\n\n\n\nIf the ribbon is not visible you may have been prompted to enable macros when you opened the document as pictured here. If you elected to disable macros, "]
[{"$nulls":6}," please close the document and reopen it with macros enabled. "]
["Purpose:"]
["The Budget Detail Worksheet is provided for your use in the preparation of the budget and budget narrative. All required information (including the budget narrative) must be provided. Any category of expense not applicable to your budget may be left blank.  Indicate any non-federal (match) amount in the appropriate category, if applicable."]
["How to use this Workbook:"]
["The workbook includes several different worksheets. The first worksheet (this one) is an instruction sheet; the next worksheet includes the budget detail worksheet and narrative for year 1.  There are duplicates of this worksheet for years 2-5 that can be completed as necessary. The last worksheet is a Budget Summary. It compiles all of the relevant budget information  into a single location and should be reviewed for correctness before the workbook is uploaded to the GMS application. \nStep by Step Usage:\n1. Please read and print this instruction page. It can be used as a reference while completing the rest of the document.\n2. For each budget category, you can see a sample by viewing the 'Budget Detail Example Sheet'.\n3. The 'Definitions' tab explains terms used in the instructions for the various budget categories.\n4. Record Retention: In accordance with the requirements set forth in 2 CFR Part 200.333, all financial records, supporting documents, statistical records, and all other records pertinent to the award shall be retained by each organization for at least three years following the closure of the audit report covering the grant period.\n5. The information disclosed in this form is subject to the Freedom of Information Act under U.S.C. 55.2."]
[]
["Budget Point of Contact Information:"]
["Contact Name: ","Last:",{"$nulls":3},"First: ",{"$nulls":3},"Middle: "]
["Contact Phone: ",null,null,"Contact Fax:",{"$nulls":3},"Contact Email:"]
["Worksheet Index:"]
["Tab"]
["Budget Detail - Year 1"]
["Budget Detail - Year 2"]
["Budget Detail - Year 3"]
["Budget Detail - Year 4"]
["Budget Detail - Year 5"]
["Budget Summary"]
["Example - Budget Detail Sheet"]
["Definitions"]
["Budget Category Descriptions:"]
["Personnel","List each position by title and name of employee, if available. Show the annual salary rate and the percentage of time to be devoted to the project. Compensation paid for employees engaged in grant activities must be consistent with that paid for similar work within the applicant organization. In the budget narrative, include a description of the responsibilities and duties of each position in relationship to fulfilling the project goals and objectives. All requested information must be included in the budget detail worksheet and budget narrative.\n"]
["Fringe Benefits","Fringe benefits should be based on actual known costs or an approved negotiated rate by a Federal agency. If not based on an approved negotiated rate, list the composition of the fringe benefit package. Fringe benefits are for the personnel listed in the budget category (A) and only for the percentage of time devoted to the project. All requested information must be included in the budget detail worksheet and budget narrative."]
["Travel","Itemize travel expenses of staff personnel (e.g. staff to training, field interviews, advisory group meeting, etc.). Describe the purpose of each travel expenditure in reference to the project objectives. Show the basis of computation (e.g., six people to 3-day training at $X airfare, $X lodging, $X subsistence). In training projects, travel and meals for trainees should be listed separately. Show the number of trainees and the unit costs involved. Identify the location of travel, if known; or if unknown, indicate \"location to be determined.\" Indicate whether applicant's formal written travel policy or the Federal Travel Regulations are followed. Note: Travel expenses for consultants should be included in the “Consultant Travel” data fields under the “Subawards (Subgrants)/Procurement Contracts” category."]
["Equipment","List non-expendable items that are to be purchased (Note: Organization's own capitalization policy for classification of equipment should be used). Expendable items should be included in the \"Supplies\" category. Applicants should analyze the cost benefits of purchasing versus leasing equipment, especially high cost items and those subject to rapid technological advances. Rented or leased equipment costs should be listed in the “Contracts” data fields under the “Subawards (Subgrants)/Procurement Contracts\" category. In the budget narrative, explain how the equipment is necessary for the success of the project, and describe the procurement method to be used. All requested information must be included in the budget detail worksheet and budget narrative."]
["Supplies","List items by type (office supplies, postage, training materials, copy paper, and expendable equipment items costing less than $5,000, such as books, hand held tape recorders) and show the basis for computation. Generally, supplies include any materials that are expendable or consumed during the course of the project. All requested information must be included in the budget detail worksheet and budget narrative."]
["Construction","Provide a description of the construction project and an estimate of the costs.   Minor repairs or renovations may be allowable and should be classified in the “Other” category. OJP does not currenly fund construction programs. Consult with the program office before budgeting funds in this category.  All requested information must be included in the budget detail worksheet and  budget narrative. "]
["Subawards (Subgrants), \nProcurement Contracts, &\nConsultant Fees","Subawards (see “Subaward” definition at 2 CFR 200.92):  Provide a description of the Federal award activities proposed to be carried out by any subrecipient and an estimate of the cost (include the cost per subrecipient, to the extent known prior to application submission).  For each subrecipient, enter the subrecipient entity name, if known.  Please indicate any subaward information included under budget category G. Subawards (Subgrants)/Procurement Contracts by including the label “(subaward)” with each subaward entry.\n\nProcurement contracts (see “Contract” definition at 2 CFR 200.22): Provide a description of the product or service to be procured by contract and an estimate of the cost.  Indicate whether the applicant’s formal, written Procurement Policy or the Federal Acquisition Regulation is followed.  Applicants are encouraged to promote free and open competition in awarding procurement contracts.  A separate justification must be provided for sole source procurements in excess of the Simplified Acquisition Threshold set in accordance with 41 U.S.C. 1908 (currently set at $150,000).\n\nConsultant Fees:  For each consultant enter the name, if known, service to be provided, hourly or daily fee (8-hour day), and estimated time on the project.  Consultant fees in excess of the DOJ grant-making component’s maximum rate for an 8-hour day (currently $650) require additional justification and prior approval from the respective DOJ grant-making component.  All requested information must be included in the budget detail worksheet and budget narrative.\n"]
["Other Costs","List items (e.g., rent, reproduction, telephone, janitorial or security services, and investigative or confidential funds) by type and the basis of the computation. For example, provide the square footage and the cost per square foot for rent, or provide a monthly rental cost and how many months to rent. All requested information must be included in the budget detail worksheet and budget narrative."]
["Indirect Costs","Indirect costs are allowed only if:  a) the applicant has a current, federally approved indirect cost rate; or b) the applicant is eligible to use and elects to use the “de minimis” indirect cost rate described in 2 C.F.R. 200.414(f).  (See paragraph D.1.b. in Appendix VII to Part 200—States and Local Government and Indian Tribe Indirect Cost Proposals for a description of entities that may not elect to use the “de minimis” rate.)  An applicant with a current, federally approved indirect cost rate must attach a  copy of the rate approval, (a fully-executed, negotiated agreement.  If the applicant does not have an approved rate, one can be requested by contacting the applicant’s cognizant Federal agency, which will review all documentation and approve a rate for the applicant organization, or if the applicant’s accounting system permits, costs may be allocated in the direct costs categories.  (Applicant Indian tribal governments, in particular, should review Appendix VII to Part 200—States and Local Government and Indian Tribe Indirect Cost Proposals regarding submission and documentation of indirect cost proposals.)  Narrative for any indirect costs should clearly state which direct costs the indirect cost agreement is being applied to.  All requested information must be included in the budget detail worksheet and budget narrative.\nIn order to use the “de minimis” indirect rate an applicant would need to attach written documentation to the application that advises DOJ of both the applicant’s eligibility (to use the “de minimis” rate) and its election. If the applicant elects the de minimis method, costs must be consistently charged as either indirect or direct costs, but may not be double charged or inconsistently charged as both. In addition, if this method is chosen then it must be used consistently for all federal awards until such time as the applicant entity chooses to negotiate a federally approved indirect cost rate.\n"]

{"sheet":"Demographics","index":1,"n_rows":164,"n_cols":9,"rows_kept":164,"hidden":true,"merged":[[0,0,0,9],[1,1,1,8],[2,0,2,3],[3,1,3,8],[4,3,4,8],[6,3,6,8],[8,1,9,5],[8,7,8,8],[10,1,11,5],[10,7,10,8],[12,1,13,5],[12,7,12,8],[14,1,15,5],[14,7,14,8],[16,1,17,5],[16,7,16,8],[18,1,19,5],[18,7,18,8],[20,1,21,5],[20,7,20,8],[22,1,22,8],[42,6,42,8],[45,1,46,8],[48,1,49,8],[50,1,51,8],[53,1,53,8],[54,1,54,8],[55,1,56,8],[58,0,58,3],[59,1,59,8],[61,2,61,8],[62,2,62,5],[62,6,62,8],[63,2,63,5],[63,6,63,8],[64,2,64,5],[64,6,64,8],[65,2,65,5],[65,6,65,8],[66,2,66,5],[66,6,66,8],[67,2,67,5],[67,6,67,8],[68,2,68,5],[68,6,68,8],[69,2,69,5],[69,6,69,8],[71,1,71,8],[72,0,78,1],[72,2,78,8],[80,1,80,8],[83,1,83,8],[84,1,84,8],[89,5,89,8],[92,1,92,8],[93,2,93,8],[94,5,94,8],[96,1,96,8],[97,2,97,8],[98,3,98,4],[98,5,98,6],[98,7,98,8],[100,1,100,8],[101,3,101,4],[102,3,102,4],[102,5,102,6],[102,7,102,8],[104,2,105,6],[105,7,105,8],[107,2,107,6],[107,7,107,8],[109,2,109,6],[109,7,109,8],[111,2,111,6],[111,7,111,8],[113,7,113,8],[115,1,115,8],[116,3,116,4],[117,3,117,4],[117,5,117,6],[117,7,117,8],[119,2,120,6],[120,7,120,8],[122,2,122,6],[122,7,122,8],[124,2,124,6],[124,7,124,8],[126,2,126,6],[126,7,126,8],[136,1,137,8],[146,4,146,8],[148,4,148,8],[151,1,152,8],[153,7,153,8],[154,7,154,8],[155,7,155,8],[156,7,156,8],[157,7,157,8],[158,7,158,8],[159,7,159,8],[160,7,160,8],[161,7,161,8],[162,7,162,8],[163,7,163,8]]}
["Demographic Form"]
[null,"Please fill out this form in its entirety. Note that each subsection has individual instructions. Please read them carefully before filling out this form. If you are applying as a consortium please aggregate the data for all the Tribes represented in your application."]
["I. Tribe Information"]
[null,"1. The name of each federally-recognized Indian Tribe that will be served by the proposed project(s):"]
[null,"Name(s)",null,"The name(s) of your tribe and represented tribes. "]
[]
[null,"BIA Region(s)"]
[]
[null,"2. What is the Tribe's current enrollment, including members living both on and off the reservation?"]
[]
[null,"3. What is the Tribe's juvenile population, including members living both on and off the reservation?"]
[]
[null,"4. Of your current enrollment, what is the Tribe's total number of unemployed 18 years and over?"]
[]
[null,"5. Of your current enrollment, what is the Tribe's total number of under-employed (below the poverty line) 18 years and over?"]
[]
[null,"6. Of your current enrollment, what is the Tribe's total number of employed 18 years and over?"]
[]
[null,"7. What is the current local population base?"]
[]
[null,"8. Please enter the approximate square mileage of the reservation/jurisdiction to be served: (sq. miles)"]
[]
[null,"9. Please check the crime victim population area(s) that best describe the services the Tribe typically supports."]
{"$rows_empty":10}
[null,"10. Have you applied for a CTAS grant before?"]
[]
[null,null,"If yes, what year?"]
[]
[null,"11. Please provide your status as an applicant (check all that apply):"]
[]
[]
[]
[]
[]
[]
[null,"a. If you selected Tribal Coalition or Tribal Consortia please list the tribes you represent:"]
[]
[]
[]
[null,"b. If you selected Non-profit organization describe the nature of you services and whom you provide them."]
[]
[]
[]
[]
[null,"12. Please indicate if you agree with the following statement: The tribe(s)submitting this application consider themselves to be remotely located with respect to availability of justice or other relevant community services."]
[null,"If you selected “Yes”, please provide a brief statement that explains your selection. Examples might include “For a majority of our tribal community, law enforcement resource centers are greater than 1 hour’s drive away.” Or  “Our tribal community has no resident medical facilities and the nearest public health center is operated by the City/Town of XXX which is not within tribal lands and not easily reached.”"]
[]
[]
[]
["II. Property/Violent Crime"]
[null,"Using the most recent available data and to the best of your ability using the UCR crime definitions, enter the actual number of incidents reported to your Tribe for the following crime types. Note that only those incidents for which your Tribe had primary response authority should be provided."]
[]
[null,null,"UCR Data *"]
[null,null,"Year"]
[null,null,"Criminal Homicide"]
[null,null,"Forcible Rape"]
[null,null,"Robbery"]
[null,null,"Aggravated Assault"]
[null,null,"Burglary"]
[null,null,"Larceny (except motor vehicle theft)"]
[null,null,"Motor Vehicle Theft"]
[]
[null,"*Note: If your Tribe is not using UCR data or reports to NIBRS, please explain the source or methods used to report your crime data. If you do not report crime incidents at all please explain why you are unable to provide such data. If instructions are needed on converting your data to UCR Summary Data style please view the COPS Application Guide of the FBI's UCR Handbook (www.fbi.gov/ucr/handbook/ucrhandbook04.pdf) for more information."]
{"$rows_empty":8}
[null,"The FBI is retiring the current Summary Reporting System (SRS) and will transition to an all-NIBRS data collection system within the next five years. The transition to NIBRS will provide a more complete and accurate picture of crime at the tribal, national, state, and local level. As of 2021, the FBI will no longer collect summary data and will only accept data in the NIBRS format and COPS Office awards will be based on submitted NIBRS data. Transitioning all law enforcement agencies to NIBRS is the first step in gathering more comprehensive crime data. Tribal, state, and local COPS grantees are encouraged to expedite the transition to NIBRS in their jurisdictions so that they will remain eligible to receive COPS Office awards."]
[]
["III. Tribal Law Enforcement Information"]
[null,"Please answer the following questions. NOTE: If you choose \"none\" for question 1 you are finished completing this section and do not need to answer 1a or 1b."]
[null,"1. What law enforcement agency or departments does your Tribe operate? (check all that apply):"]
{"$rows_empty":7}
[null,"a. What is the actual population your department serves as the primary law enforcement agency entity?"]
[null,null,"This may or may not be the same as the population reported in the U.S. Census, the Tribe's current enrollment or the local population base. A Tribe with primary law enforcement authority is defined as having first responder responsibility to calls for service for all types of criminal incidents within its jurisdiction."]
[]
[]
[null,"b. Enter the current Fiscal Year Actual Sworn Force Strength as of the date of this application:"]
[null,null,"The actual number of sworn officer positions is the actual number of sworn positions employed by your Tribe as of the date of this application. Do not include funded but currently vacant positions or unpaid positions. NOTE: For Tribes with multiple component law enforcement departments (e.g. Department of Public Safety and Fish and Wildlife Department), please report cumulative, full- and part-time sworn-force strength number for all law enforcement departments in your Tribe which would receive funding through this request if awarded."]
[null,null,"Full-Time:",null,null,"Part-Time:"]
[]
[null,"2. On average how many hours of IN-SERVICE (non-recruit) training (e.g. FTO, continuing professional education, roll call, standard) are required annually for each of your agency’s officers/deputies in the following categories (if none, please indicate 0 hours)?"]
[]
[null,null,"Use of Force:",null,null,"De-escalation of conflict:"]
[]
[null,null,"Racial and ethnic bias that includes elements of implicit/unconscious bias:     "]
[]
[]
[null,null,"Gender bias in response to domestic violence and sexual assault:"]
[]
[null,null,"Bias towards lesbian, gay, bisexual, and transgender (LGBT) individuals:"]
[]
[null,null,"Community engagement (e.g., community policing and problem solving):"]
[]
[null,"3. Does your agency administer a police training academy? "]
[]
[null,"4. How many total hours of basic/recruit ACADEMY training are required for each of your agency’s officer/deputy recruits in the following categories (if none, please indicate 0 hours)?"]
[]
[null,null,"Use of Force:",null,null,"De-escalation of conflict:"]
[]
[null,null,"Racial and ethnic bias that includes elements of implicit/unconscious bias:     "]
[]
[]
[null,null,"Gender bias in response to domestic violence and sexual assault:"]
[]
[null,null,"Bias towards lesbian, gay, bisexual, and transgender (LGBT) individuals:"]
[]
[null,null,"Community engagement (e.g., community policing and problem solving):"]
[]
["IV. Tribal Facilities, Capacities and Capabilities"]
[null,"1. Telecommunications and Technology"]
[null,"a. Describe your Internet Access:"]
[]
[]
[]
[]
[]
[null,"b. What types of communication services are generally available to the tribe at large and/or the tribe's justice components? (check all that apply)"]
[]
[{"$nulls":7},"Tribe","Justice "]
[null,null,"i. Land Line (telephone, dial-up service)"]
[null,null,"ii. Cellular (telephone, data, etc.)"]
[null,null,"iii. Satellite - Receive only (broadcasting services)"]
[null,null,"iv. Satellite - 2-way (2-way voice and data and well as broadcasting)"]
[null,null,"v. Radio services  - (HF, VHF, UHF)"]
[null,null,"vi. Point to Point Microwave "]
[null,null,"vii. Other (please describe)"]
[{"$nulls":3},"Tribal"]
[]
[{"$nulls":3},"Justice Comp."]
[]
[null,"2. Facilities and Services (check all that apply)"]
[null,"Applicants should check and provide data for all the facilities and services located within the reservation/jurisdiction described in question 8 above. "]
[]
[{"$nulls":6},"# of beds"]
[{"$nulls":6},"# of facilities"]
[{"$nulls":6},"# of facilities"]
[{"$nulls":6},"# of facilities"]
[{"$nulls":6},"# of facilities"]
[{"$nulls":6},"# of beds"]
[{"$nulls":6},"# of beds"]
[{"$nulls":6},"# of facilities"]
[{"$nulls":6},"# of facilities"]
[{"$nulls":6},"# of facilities"]
[{"$nulls":6},"# of facilities"]

{"sheet":"Budget Detail - Year 1","index":2,"n_rows":139,"n_cols":12,"rows_kept":139,"merged":[[0,0,0,5],[0,7,0,11],[1,0,1,9],[1,10,2,11],[2,0,2,1],[4,2,4,11],[5,2,5,11],[6,0,7,1],[6,2,7,3],[6,4,7,4],[6,5,7,6],[6,7,7,8],[6,9,7,9],[6,10,7,10],[6,11,7,11],[8,2,8,3],[8,5,8,6],[8,7,8,8],[9,2,9,3],[9,5,9,6],[9,7,9,8],[10,2,10,3],[10,5,10,6],[10,7,10,8],[11,0,11,8],[13,0,14,11],[16,0,16,2],[16,3,16,11],[17,0,17,2],[17,3,17,11],[18,0,19,2],[18,3,19,4],[18,5,19,8],[18,9,19,9],[18,10,19,10],[18,11,19,11],[20,0,20,2],[20,3,20,4],[20,5,20,8],[21,0,21,2],[21,3,21,4],[21,5,21,8],[22,0,22,2],[22,3,22,4],[22,5,22,8],[23,0,23,8],[25,0,26,11],[28,1,28,2],[28,5,28,11],[29,1,29,2],[29,5,29,11],[30,0,31,4],[30,5,31,5],[30,6,31,6],[30,7,31,7],[30,8,31,8],[30,9,31,9],[30,10,31,10],[30,11,31,11],[32,1,32,2],[33,1,33,2],[34,1,34,2],[35,0,35,8],[37,0,38,11],[40,0,40,2],[40,3,40,11],[41,0,41,2],[41,3,41,11],[42,0,43,2],[42,3,43,4],[42,5,43,8],[42,9,43,9],[42,10,43,10],[42,11,43,11],[44,0,44,2],[44,3,44,4],[44,5,44,8],[45,0,45,2],[45,3,45,4],[45,5,45,8],[46,0,46,2],[46,3,46,4],[46,5,46,8],[47,0,47,8],[49,0,50,11],[52,0,52,2],[52,3,52,11],[53,0,53,2],[53,3,53,11],[54,0,55,2],[54,3,55,4],[54,5,55,8],[54,9,55,9],[54,10,55,10],[54,11,55,11],[56,0,56,2],[56,3,56,4],[56,5,56,8],[57,0,57,2],[57,3,57,4],[57,5,57,8],[58,0,58,2],[58,3,58,4],[58,5,58,8],[59,0,59,8],[61,0,62,11],[64,1,64,2],[64,3,64,11],[65,1,65,2],[65,3,65,11],[66,0,67,2],[66,3,67,4],[66,5,67,8],[66,9,67,9],[66,10,67,10],[66,11,67,11],[68,1,68,2],[68,3,68,4],[68,5,68,8],[69,1,69,2],[69,3,69,4],[69,5,69,8],[70,1,70,2],[70,3,70,4],[70,5,70,8],[71,0,71,8],[73,0,74,11],[75,0,75,1],[76,0,76,1],[76,2,76,6],[76,7,76,8],[76,9,77,11],[77,0,77,1],[77,2,77,6],[77,7,77,8],[78,9,79,9],[78,10,79,10],[78,11,79,11],[80,0,80,1],[80,2,80,6],[80,7,80,8],[81,0,81,1],[81,2,81,6],[81,7,81,8],[82,0,82,1],[82,2,82,6],[82,7,82,8],[83,0,83,8],[84,0,84,1],[85,1,85,2],[85,3,85,5],[85,6,85,11],[86,1,86,2],[86,3,86,5],[86,6,86,11],[87,0,88,5],[87,6,88,6],[87,7,88,7],[87,8,88,8],[87,9,88,9],[87,10,88,10],[87,11,88,11],[89,1,89,2],[89,3,89,5],[90,1,90,2],[90,3,90,5],[91,1,91,2],[91,3,91,5],[92,0,92,8],[94,0,95,11],[96,0,96,1],[97,0,97,1],[97,2,97,6],[97,7,97,8],[98,0,98,1],[98,2,98,6],[98,7,98,8],[99,0,100,1],[99,9,100,9],[99,10,100,10],[99,11,100,11],[101,0,101,1],[101,2,101,6],[101,7,101,8],[102,0,102,1],[102,2,102,6],[102,7,102,8],[103,0,103,1],[103,2,103,6],[103,7,103,8],[104,0,104,8],[105,0,105,1],[106,1,106,2],[106,3,106,5],[106,6,106,11],[107,1,107,2],[107,3,107,5],[107,6,107,11],[108,0,109,5],[108,6,109,6],[108,7,109,7],[108,8,109,8],[108,9,109,9],[108,10,109,10],[108,11,109,11],[110,1,110,2],[110,3,110,5],[111,1,111,2],[111,3,111,5],[112,1,112,2],[112,3,112,5],[113,0,113,8],[115,0,116,11],[118,0,118,1],[118,2,118,11],[119,0,119,1],[119,2,119,11],[120,2,121,3],[120,4,121,4],[120,5,121,6],[120,7,121,8],[120,9,121,9],[120,10,121,10],[120,11,121,11],[122,0,122,1],[122,2,122,3],[122,5,122,6],[122,7,122,8],[123,0,123,1],[123,2,123,3],[123,5,123,6],[123,7,123,8],[124,0,124,1],[124,2,124,3],[124,5,124,6],[124,7,124,8],[125,0,125,8],[127,0,128,11],[130,0,130,2],[130,3,130,11],[131,0,131,2],[131,3,131,11],[132,0,133,2],[132,3,133,4],[132,5,133,8],[132,9,133,9],[132,10,133,10],[132,11,133,11],[134,0,134,2],[134,3,134,4],[134,5,134,8],[135,0,135,2],[135,3,135,4],[135,5,135,8],[136,0,136,2],[136,3,136,4],[136,5,136,8],[137,0,137,8],[139,0,140,11]]}
[{"$f":"'Budget Sheet Instructions'!A17","v":"Budget Detail - Year 1"}]
["Does this budget contain conference costs which is defined broadly to include meetings, retreats, seminars, symposia, and training activities? - Y/N"]
["(DOJ Financial Guide, Section 3.10)"]
["A. Personnel"]
["Name","Position","Computation"]
["List each name, if known.","List each position, if known.","Show annual salary rate & amount of time devoted to the project for each name/position."]
[null,null,"Salary ",null,"Rate","Time Worked\n(# of hours, days, months, years)",null,"Percentage of Time",null,"Total Cost","Non-Federal Contribution","Federal Request"]
[]
[{"$nulls":9},{"$f":"CEILING(C9*F9*H9,1)","v":{"v":0,"d":"$0"}},null,{"$f":"IF(J9-K9<0,0,J9-K9)","v":{"v":0,"d":"$0"}}]
[{"$nulls":9},{"$f":"CEILING(C10*F10*H10,1)","v":{"v":0,"d":"$0"}},null,{"$f":"IF(J10-K10<0,0,J10-K10)","v":{"v":0,"d":"$0"}}]
[{"$nulls":9},{"$f":"CEILING(C11*F11*H11,1)","v":{"v":0,"d":"$0"}},null,{"$f":"IF(J11-K11<0,0,J11-K11)","v":{"v":0,"d":"$0"}}]
["Total(s)",{"$nulls":8},{"$f":"SUM(J9:J11)","v":{"v":0,"d":"$0"}},{"$f":"SUM(K9:K11)","v":{"v":0,"d":"$0"}},{"$f":"SUM(L9:L11)","v":{"v":0,"d":"$0"}}]
["Narrative"]
[]
[]
["B. Fringe Benefits"]
["Name",null,null,"Computation"]
["List each grant-supported position receiving fringe benefits.",null,null,"Show the basis for computation."]
[{"$nulls":3},"Base",null,"Rate",{"$nulls":3},"Total Cost","Non-Federal Contribution","Federal Request"]
[]
[{"$nulls":9},{"$f":"CEILING(D21*F21,1)","v":{"v":0,"d":"$0"}},null,{"$f":"IF(J21-K21<0,0,J21-K21)","v":{"v":0,"d":"$0"}}]
[{"$nulls":9},{"$f":"CEILING(D22*F22,1)","v":{"v":0,"d":"$0"}},null,{"$f":"IF(J22-K22<0,0,J22-K22)","v":{"v":0,"d":"$0"}}]
[{"$nulls":9},{"$f":"CEILING(D23*F23,1)","v":{"v":0,"d":"$0"}},null,{"$f":"IF(J23-K23<0,0,J23-K23)","v":{"v":0,"d":"$0"}}]
["Total(s)",{"$nulls":8},{"$f":"SUM(J21:J23)","v":{"v":0,"d":"$0"}},{"$f":"SUM(K21:K23)","v":{"v":0,"d":"$0"}},{"$f":"SUM(L21:L23)","v":{"v":0,"d":"$0"}}]
["Narrative"]
[]
[]
["C. Travel"]
["Purpose of Travel","Location",null,"Type of Expense","Basis","Computation"]
["Indicate the purpose of each trip or type of trip (training, advisory group meeting)","Indicate the travel destination.",null,"Lodging, Meals, Etc.","Per day, mile, trip, Etc.","Compute the cost of each type of expense X the number of people traveling."]
[{"$nulls":5},"Cost","Quantity","# of Staff","# of Trips","Total Cost","Non-Federal Contribution","Federal Request"]
[]
[{"$nulls":4},{"$f":"IF((D33=\"Lodging\"),\"Night\",IF((D33=\"Meals\"),\"Day\",IF((D33=\"Mileage\"),\"Mile\",IF((D33=\"Transportation\"),\"Round-trip\",\"N/A\"))))","v":"N/A"},{"$nulls":4},{"$f":"CEILING(F33*G33*H33*I33,1)","v":{"v":0,"d":"$0"}},null,{"$f":"IF(J33-K33<0,0,J33-K33)","v":{"v":0,"d":"$0"}}]
[{"$nulls":4},{"$f":"IF((D34=\"Lodging\"),\"Night\",IF((D34=\"Meals\"),\"Day\",IF((D34=\"Mileage\"),\"Mile\",IF((D34=\"Transportation\"),\"Round-trip\",\"N/A\"))))","v":"N/A"},{"$nulls":4},{"$f":"CEILING(F34*G34*H34*I34,1)","v":{"v":0,"d":"$0"}},null,{"$f":"IF(J34-K34<0,0,J34-K34)","v":{"v":0,"d":"$0"}}]
[{"$nulls":4},{"$f":"IF((D35=\"Lodging\"),\"Night\",IF((D35=\"Meals\"),\"Day\",IF((D35=\"Mileage\"),\"Mile\",IF((D35=\"Transportation\"),\"Round-trip\",\"N/A\"))))","v":"N/A"},{"$nulls":4},{"$f":"CEILING(F35*G35*H35*I35,1)","v":{"v":0,"d":"$0"}},null,{"$f":"IF(J35-K35<0,0,J35-K35)","v":{"v":0,"d":"$0"}}]
["Total(s)",{"$nulls":8},{"$f":"SUM(J33:J35)","v":{"v":0,"d":"$0"}},{"$f":"SUM(K33:K35)","v":{"v":0,"d":"$0"}},{"$f":"SUM(L33:L35)","v":{"v":0,"d":"$0"}}]
["Narrative"]
[]
[]
["D. Equipment"]
["Item",null,null,"Computation"]
["List and describe each item of equipment that will be purchased",null,null,"Compute the cost (e.g., the number of each item to be purchased X the cost per item)"]
[{"$nulls":3},"# of Items",null,"Unit Cost",{"$nulls":3},"Total Cost","Non-Federal Contribution","Federal Request"]
[]
[{"$nulls":9},{"$f":"CEILING(D45*F45,1)","v":{"v":0,"d":"$0"}},null,{"$f":"IF(J45-K45<0,0,J45-K45)","v":{"v":0,"d":"$0"}}]
[{"$nulls":9},{"$f":"CEILING(D46*F46,1)","v":{"v":0,"d":"$0"}},null,{"$f":"IF(J46-K46<0,0,J46-K46)","v":{"v":0,"d":"$0"}}]
[{"$nulls":9},{"$f":"CEILING(D47*F47,1)","v":{"v":0,"d":"$0"}},null,{"$f":"IF(J47-K47<0,0,J47-K47)","v":{"v":0,"d":"$0"}}]
["Total(s)",{"$nulls":8},{"$f":"SUM(J45:J47)","v":{"v":0,"d":"$0"}},{"$f":"SUM(K45:K47)","v":{"v":0,"d":"$0"}},{"$f":"SUM(L45:L47)","v":{"v":0,"d":"$0"}}]
["Narrative"]
[]
[]
["E. Supplies"]
["Supply Items",null,null,"Computation"]
["Provide a list of the types of items to be purchased with grant funds.",null,null,"Describe the item and the compute the costs. Computation: The number of each item to be purchased X the cost per item."]
[{"$nulls":3},"# of Items",null,"Unit Cost",{"$nulls":3},"Total Cost","Non-Federal Contribution","Federal Request"]
[]
[{"$nulls":9},{"$f":"CEILING(D57*F57,1)","v":{"v":0,"d":"$0"}},null,{"$f":"IF(J57-K57<0,0,J57-K57)","v":{"v":0,"d":"$0"}}]
[{"$nulls":9},{"$f":"CEILING(D58*F58,1)","v":{"v":0,"d":"$0"}},null,{"$f":"IF(J58-K58<0,0,J58-K58)","v":{"v":0,"d":"$0"}}]
[{"$nulls":9},{"$f":"CEILING(D59*F59,1)","v":{"v":0,"d":"$0"}},null,{"$f":"IF(J59-K59<0,0,J59-K59)","v":{"v":0,"d":"$0"}}]
["Total(s)",{"$nulls":8},{"$f":"SUM(J57:J59)","v":{"v":0,"d":"$0"}},{"$f":"SUM(K57:K59)","v":{"v":0,"d":"$0"}},{"$f":"SUM(L57:L59)","v":{"v":0,"d":"$0"}}]
["Narrative"]
[]
[]
["F. Construction"]
["Purpose","Description of Work",null,"Computation"]
["Provide the purpose of the construction","Describe the construction project(s)",null,"Compute the costs (e.g., the number of each item to be purchased X the cost per item)"]
[{"$nulls":3},"# of Items",null,"Cost",{"$nulls":3},"Total Cost","Non-Federal Contribution","Federal Request"]
[]
[{"$nulls":9},{"$f":"CEILING(D69*F69,1)","v":{"v":0,"d":"$0"}},null,{"$f":"IF(J69-K69<0,0,J69-K69)","v":{"v":0,"d":"$0"}}]
[{"$nulls":9},{"$f":"CEILING(D70*F70,1)","v":{"v":0,"d":"$0"}},null,{"$f":"IF(J70-K70<0,0,J70-K70)","v":{"v":0,"d":"$0"}}]
[{"$nulls":9},{"$f":"CEILING(D71*F71,1)","v":{"v":0,"d":"$0"}},null,{"$f":"IF(J71-K71<0,0,J71-K71)","v":{"v":0,"d":"$0"}}]
["Total(s)",{"$nulls":8},{"$f":"SUM(J69:J71)","v":{"v":0,"d":"$0"}},{"$f":"SUM(K69:K71)","v":{"v":0,"d":"$0"}},{"$f":"SUM(L69:L71)","v":{"v":0,"d":"$0"}}]
["Narrative"]
[]
[]
["G. Subawards (Subgrants)"]
["Description",null,"Purpose",{"$nulls":4},"Consultant?"]
["Provide a description of the activities to be carried out by subrecipients.",null,"Describe the purpose of the subaward (subgrant)",{"$nulls":4},"Is the subaward for a consultant? If yes, use the section below to explain associated travel expenses included in the cost."]
[{"$nulls":9},"Total Cost","Non-Federal Contribution","Federal Request"]
[]
[{"$nulls":11},{"$f":"IF(J81-K81<0,0,J81-K81)","v":{"v":0,"d":"$0"}}]
[{"$nulls":11},{"$f":"IF(J82-K82<0,0,J82-K82)","v":{"v":0,"d":"$0"}}]
[{"$nulls":11},{"$f":"IF(J83-K83<0,0,J83-K83)","v":{"v":0,"d":"$0"}}]
["Total(s)",{"$nulls":8},{"$f":"SUM(J81:J83)+J93","v":{"v":0,"d":"$0"}},{"$f":"SUM(K81:K83)+K93","v":{"v":0,"d":"$0"}},{"$f":"SUM(L81:L83)+L93","v":{"v":0,"d":"$0"}}]
["Consultant Travel (if necessary)"]
["Purpose of Travel","Location",null,"Type of Expense",null,null,"Computation"]
["Indicate the purpose of each trip or type of trip (training, advisory group meeting)","Indicate the travel destination.",null,"Hotel, airfare, per diem",null,null,"Compute the cost of each type of expense X the number of people traveling."]
[{"$nulls":6},"Cost","Duration or Distance","# of Staff","Total Cost","Non-Federal Contribution","Federal Request"]
[]
[{"$nulls":9},{"$f":"CEILING(G90*H90*I90,1)","v":{"v":0,"d":"$0"}},null,{"$f":"IF(J90-K90<0,0,J90-K90)","v":{"v":0,"d":"$0"}}]
[{"$nulls":9},{"$f":"CEILING(G91*H91*I91,1)","v":{"v":0,"d":"$0"}},null,{"$f":"IF(J91-K91<0,0,J91-K91)","v":{"v":0,"d":"$0"}}]
[{"$nulls":9},{"$f":"CEILING(G92*H92*I92,1)","v":{"v":0,"d":"$0"}},null,{"$f":"IF(J92-K92<0,0,J92-K92)","v":{"v":0,"d":"$0"}}]
["Total",{"$nulls":8},{"$f":"SUM(J90:J92)","v":{"v":0,"d":"$0"}},{"$f":"SUM(K90:K92)","v":{"v":0,"d":"$0"}},{"$f":"SUM(L90:L92)","v":{"v":0,"d":"$0"}}]
["Narrative"]
[]
[]
["H. Procurement Contracts"]
["Description",null,"Purpose",{"$nulls":4},"Consultant?"]
["Provide a description of the products or services to be procured by contract and an estimate of the costs.  Applicants are encouraged to promote free and open competition in awarding contracts.  A separate justification must be provided for sole source procurements in excess of the Simplified Acquisition Threshold (currently $150,000). ",null,"Describe the purpose of the contract",{"$nulls":4},"Is the subaward for a consultant? If yes, use the section below to explain associated travel expenses included in the cost."]
[{"$nulls":9},"Total Cost","Non-Federal Contribution","Federal Request"]
[]
[{"$nulls":11},{"$f":"IF(J102-K102<0,0,J102-K102)","v":{"v":0,"d":"$0"}}]
[{"$nulls":11},{"$f":"IF(J103-K103<0,0,J103-K103)","v":{"v":0,"d":"$0"}}]
[{"$nulls":11},{"$f":"IF(J104-K104<0,0,J104-K104)","v":{"v":0,"d":"$0"}}]
["Total(s)",{"$nulls":8},{"$f":"SUM(J102:J104)+J114","v":{"v":0,"d":"$0"}},{"$f":"SUM(K102:K104)+K114","v":{"v":0,"d":"$0"}},{"$f":"SUM(L102:L104)+L114","v":{"v":0,"d":"$0"}}]
["Consultant Travel (if necessary)"]
["Purpose of Travel","Location",null,"Type of Expense",null,null,"Computation"]
["Indicate the purpose of each trip or type of trip (training, advisory group meeting)","Indicate the travel destination.",null,"Hotel, airfare, per diem",null,null,"Compute the cost of each type of expense X the number of people traveling."]
[{"$nulls":6},"Cost","Duration or Distance","# of Staff","Total Cost","Non-Federal Contribution","Federal Request"]
[]
[{"$nulls":9},{"$f":"CEILING(G111*H111*I111,1)","v":{"v":0,"d":"$0"}},null,{"$f":"IF(J111-K111<0,0,J111-K111)","v":{"v":0,"d":"$0"}}]
[{"$nulls":9},{"$f":"CEILING(G112*H112*I112,1)","v":{"v":0,"d":"$0"}},null,{"$f":"IF(J112-K112<0,0,J112-K112)","v":{"v":0,"d":"$0"}}]
[{"$nulls":9},{"$f":"CEILING(G113*H113*I113,1)","v":{"v":0,"d":"$0"}},null,{"$f":"IF(J113-K113<0,0,J113-K113)","v":{"v":0,"d":"$0"}}]
["Total",{"$nulls":8},{"$f":"SUM(J111:J113)","v":{"v":0,"d":"$0"}},{"$f":"SUM(K111:K113)","v":{"v":0,"d":"$0"}},{"$f":"SUM(L111:L113)","v":{"v":0,"d":"$0"}}]
["Narrative"]
[]
[]
["I. Other Costs"]
["Description ",null,"Computation"]
["List and describe items that will be paid with grants funds (e.g. rent, reproduction, telephone, janitorial, or security services, and investigative or confidential funds).",null,"Show the basis for computation"]
[null,null,"Quantity",null,"Basis","Cost",null,"Length of Time",null,"Total Cost","Non-Federal Contribution","Federal Request"]
[]
[{"$nulls":9},{"$f":"CEILING(C123*F123*H123,1)","v":{"v":0,"d":"$0"}},null,{"$f":"IF(J123-K123<0,0,J123-K123)","v":{"v":0,"d":"$0"}}]
[{"$nulls":9},{"$f":"CEILING(C124*F124*H124,1)","v":{"v":0,"d":"$0"}},null,{"$f":"IF(J124-K124<0,0,J124-K124)","v":{"v":0,"d":"$0"}}]
[{"$nulls":9},{"$f":"CEILING(C125*F125*H125,1)","v":{"v":0,"d":"$0"}},null,{"$f":"IF(J125-K125<0,0,J125-K125)","v":{"v":0,"d":"$0"}}]
["Total(s)",{"$nulls":8},{"$f":"SUM(J123:J125)","v":{"v":0,"d":"$0"}},{"$f":"SUM(K123:K125)","v":{"v":0,"d":"$0"}},{"$f":"SUM(L123:L125)","v":{"v":0,"d":"$0"}}]
["Narrative"]
[]
[]
["J. Indirect Costs"]
["Description",null,null,"Computation"]
["Describe what the approved rate is and how it is applied.",null,null,"Compute the indirect costs for those portions of the program which allow such costs."]
[{"$nulls":3},"Base",null,"Indirect Cost Rate",{"$nulls":3},"Total Cost","Non-Federal Contribution","Federal Request"]
[]
[{"$nulls":9},{"$f":"CEILING(D135*F135,1)","v":{"v":0,"d":"$0"}},null,{"$f":"IF(J135-K135<0,0,J135-K135)","v":{"v":0,"d":"$0"}}]
[{"$nulls":9},{"$f":"CEILING(D136*F136,1)","v":{"v":0,"d":"$0"}},null,{"$f":"IF(J136-K136<0,0,J136-K136)","v":{"v":0,"d":"$0"}}]
[{"$nulls":9},{"$f":"CEILING(D137*F137,1)","v":{"v":0,"d":"$0"}},null,{"$f":"IF(J137-K137<0,0,J137-K137)","v":{"v":0,"d":"$0"}}]
["Total(s)",{"$nulls":8},{"$f":"SUM(J135:J137)","v":{"v":0,"d":"$0"}},{"$f":"SUM(K135:K137)","v":{"v":0,"d":"$0"}},{"$f":"SUM(L135:L137)","v":{"v":0,"d":"$0"}}]
["Narrative"]

{"sheet":"Budget Detail - Year 2","index":3,"n_rows":139,"n_cols":12,"rows_kept":139,"merged":[[0,0,0,5],[0,7,0,11],[1,0,1,9],[1,10,2,11],[2,0,2,1],[4,2,4,11],[5,2,5,11],[6,0,7,1],[6,2,7,3],[6,4,7,4],[6,5,7,6],[6,7,7,8],[6,9,7,9],[6,10,7,10],[6,11,7,11],[8,2,8,3],[8,5,8,6],[8,7,8,8],[9,2,9,3],[9,5,9,6],[9,7,9,8],[10,2,10,3],[10,5,10,6],[10,7,10,8],[11,0,11,8],[13,0,14,11],[16,0,16,2],[16,3,16,11],[17,0,17,2],[17,3,17,11],[18,0,19,2],[18,3,19,4],[18,5,19,8],[18,9,19,9],[18,10,19,10],[18,11,19,11],[20,0,20,2],[20,3,20,4],[20,5,20,8],[21,0,21,2],[21,3,21,4],[21,5,21,8],[22,0,22,2],[22,3,22,4],[22,5,22,8],[23,0,23,8],[25,0,26,11],[28,1,28,2],[28,5,28,11],[29,1,29,2],[29,5,29,11],[30,0,31,4],[30,5,31,5],[30,6,31,6],[30,7,31,7],[30,8,31,8],[30,9,31,9],[30,10,31,10],[30,11,31,11],[32,1,32,2],[33,1,33,2],[34,1,34,2],[35,0,35,8],[37,0,38,11],[40,0,40,2],[40,3,40,11],[41,0,41,2],[41,3,41,11],[42,0,43,2],[42,3,43,4],[42,5,43,8],[42,9,43,9],[42,10,43,10],[42,11,43,11],[44,0,44,2],[44,3,44,4],[44,5,44,8],[45,0,45,2],[45,3,45,4],[45,5,45,8],[46,0,46,2],[46,3,46,4],[46,5,46,8],[47,0,47,8],[49,0,50,11],[52,0,52,2],[52,3,52,11],[53,0,53,2],[53,3,53,11],[54,0,55,2],[54,3,55,4],[54,5,55,8],[54,9,55,9],[54,10,55,10],[54,11,55,11],[56,0,56,2],[56,3,56,4],[56,5,56,8],[57,0,57,2],[57,3,57,4],[57,5,57,8],[58,0,58,2],[58,3,58,4],[58,5,58,8],[59,0,59,8],[61,0,62,11],[64,1,64,2],[64,3,64,11],[65,1,65,2],[65,3,65,11],[66,0,67,2],[66,3,67,4],[66,5,67,8],[66,9,67,9],[66,10,67,10],[66,11,67,11],[68,1,68,2],[68,3,68,4],[68,5,68,8],[69,1,69,2],[69,3,69,4],[69,5,69,8],[70,1,70,2],[70,3,70,4],[70,5,70,8],[71,0,71,8],[73,0,74,11],[75,0,75,1],[76,0,76,1],[76,2,76,6],[76,7,76,8],[76,9,77,11],[77,0,77,1],[77,2,77,6],[77,7,77,8],[78,9,79,9],[78,10,79,10],[78,11,79,11],[80,0,80,1],[80,2,80,6],[80,7,80,8],[81,0,81,1],[81,2,81,6],[81,7,81,8],[82,0,82,1],[82,2,82,6],[82,7,82,8],[83,0,83,8],[84,0,84,1],[85,1,85,2],[85,3,85,5],[85,6,85,11],[86,1,86,2],[86,3,86,5],[86,6,86,11],[87,0,88,5],[87,6,88,6],[87,7,88,7],[87,8,88,8],[87,9,88,9],[87,10,88,10],[87,11,88,11],[89,1,89,2],[89,3,89,5],[90,1,90,2],[90,3,90,5],[91,1,91,2],[91,3,91,5],[92,0,92,8],[94,0,95,11],[96,0,96,1],[97,0,97,1],[97,2,97,6],[97,7,97,8],[98,0,98,1],[98,2,98,6],[98,7,98,8],[99,0,100,1],[99,9,100,9],[99,10,100,10],[99,11,100,11],[101,0,101,1],[101,2,101,6],[101,7,101,8],[102,0,102,1],[102,2,102,6],[102,7,102,8],[103,0,103,1],[103,2,103,6],[103,7,103,8],[104,0,104,8],[105,0,105,1],[106,1,106,2],[106,3,106,5],[106,6,106,11],[107,1,107,2],[107,3,107,5],[107,6,107,11],[108,0,109,5],[108,6,109,6],[108,7,109,7],[108,8,109,8],[108,9,109,9],[108,10,109,10],[108,11,109,11],[110,1,110,2],[110,3,110,5],[111,1,111,2],[111,3,111,5],[112,1,112,2],[112,3,112,5],[113,0,113,8],[115,0,116,11],[118,0,118,1],[118,2,118,11],[119,0,119,1],[119,2,119,11],[120,2,121,3],[120,4,121,4],[120,5,121,6],[120,7,121,8],[120,9,121,9],[120,10,121,10],[120,11,121,11],[122,0,122,1],[122,2,122,3],[122,5,122,6],[122,7,122,8],[123,0,123,1],[123,2,123,3],[123,5,123,6],[123,7,123,8],[124,0,124,1],[124,2,124,3],[124,5,124,6],[124,7,124,8],[125,0,125,8],[127,0,128,11],[130,0,130,2],[130,3,130,11],[131,0,131,2],[131,3,131,11],[132,0,133,2],[132,3,133,4],[132,5,133,8],[132,9,133,9],[132,10,133,10],[132,11,133,11],[134,0,134,2],[134,3,134,4],[134,5,134,8],[135,0,135,2],[135,3,135,4],[135,5,135,8],[136,0,136,2],[136,3,136,4],[136,5,136,8],[137,0,137,8],[139,0,140,11]]}
[{"$f":"'Budget Sheet Instructions'!A18","v":"Budget Detail - Year 2"}]
["Does this budget contain conference costs which is defined broadly to include meetings, retreats, seminars, symposia, and training activities? - Y/N"]
["(DOJ Financial Guide, Section 3.10)"]
["A. Personnel"]
["Name","Position","Computation"]
["List each name, if known.","List each position, if known.","Show annual salary rate & amount of time devoted to the project for each name/position."]
[null,null,"Salary ",null,"Rate","Time Worked\n(# of hours, days, months, years)",null,"Percentage of Time",null,"Total Cost","Non-Federal Contribution","Federal Request"]
[]
[{"$nulls":9},{"$f":"CEILING(C9*F9*H9,1)","v":{"v":0,"d":"$0"}},null,{"$f":"IF(J9-K9<0,0,J9-K9)","v":{"v":0,"d":"$0"}}]
[{"$nulls":9},{"$f":"CEILING(C10*F10*H10,1)","v":{"v":0,"d":"$0"}},null,{"$f":"IF(J10-K10<0,0,J10-K10)","v":{"v":0,"d":"$0"}}]
[{"$nulls":9},{"$f":"CEILING(C11*F11*H11,1)","v":{"v":0,"d":"$0"}},null,{"$f":"IF(J11-K11<0,0,J11-K11)","v":{"v":0,"d":"$0"}}]
["Total(s)",{"$nulls":8},{"$f":"SUM(J9:J11)","v":{"v":0,"d":"$0"}},{"$f":"SUM(K9:K11)","v":{"v":0,"d":"$0"}},{"$f":"SUM(L9:L11)","v":{"v":0,"d":"$0"}}]
["Narrative"]
[]
[]
["B. Fringe Benefits"]
["Name",null,null,"Computation"]
["List each grant-supported position receiving fringe benefits.",null,null,"Show the basis for computation."]
[{"$nulls":3},"Base",null,"Rate",{"$nulls":3},"Total Cost","Non-Federal Contribution","Federal Request"]
[]
[{"$nulls":9},{"$f":"CEILING(D21*F21,1)","v":{"v":0,"d":"$0"}},null,{"$f":"IF(J21-K21<0,0,J21-K21)","v":{"v":0,"d":"$0"}}]
[{"$nulls":9},{"$f":"CEILING(D22*F22,1)","v":{"v":0,"d":"$0"}},null,{"$f":"IF(J22-K22<0,0,J22-K22)","v":{"v":0,"d":"$0"}}]
[{"$nulls":9},{"$f":"CEILING(D23*F23,1)","v":{"v":0,"d":"$0"}},null,{"$f":"IF(J23-K23<0,0,J23-K23)","v":{"v":0,"d":"$0"}}]
["Total(s)",{"$nulls":8},{"$f":"SUM(J21:J23)","v":{"v":0,"d":"$0"}},{"$f":"SUM(K21:K23)","v":{"v":0,"d":"$0"}},{"$f":"SUM(L21:L23)","v":{"v":0,"d":"$0"}}]
["Narrative"]
[]
[]
["C. Travel"]
["Purpose of Travel","Location",null,"Type of Expense","Basis","Computation"]
["Indicate the purpose of each trip or type of trip (training, advisory group meeting)","Indicate the travel destination.",null,"Lodging, Meals, Etc.","Per day, mile, trip, Etc.","Compute the cost of each type of expense X the number of people traveling."]
[{"$nulls":5},"Cost","Quantity","# of Staff","# of Trips","Total Cost","Non-Federal Contribution","Federal Request"]
[]
[{"$nulls":4},{"$f":"IF((D33=\"Lodging\"),\"Night\",IF((D33=\"Meals\"),\"Day\",IF((D33=\"Mileage\"),\"Mile\",IF((D33=\"Transportation\"),\"Round-trip\",\"N/A\"))))","v":"N/A"},{"$nulls":4},{"$f":"CEILING(F33*G33*H33*I33,1)","v":{"v":0,"d":"$0"}},null,{"$f":"IF(J33-K33<0,0,J33-K33)","v":{"v":0,"d":"$0"}}]
[{"$nulls":4},{"$f":"IF((D34=\"Lodging\"),\"Night\",IF((D34=\"Meals\"),\"Day\",IF((D34=\"Mileage\"),\"Mile\",IF((D34=\"Transportation\"),\"Round-trip\",\"N/A\"))))","v":"N/A"},{"$nulls":4},{"$f":"CEILING(F34*G34*H34*I34,1)","v":{"v":0,"d":"$0"}},null,{"$f":"IF(J34-K34<0,0,J34-K34)","v":{"v":0,"d":"$0"}}]
[{"$nulls":4},{"$f":"IF((D35=\"Lodging\"),\"Night\",IF((D35=\"Meals\"),\"Day\",IF((D35=\"Mileage\"),\"Mile\",IF((D35=\"Transportation\"),\"Round-trip\",\"N/A\"))))","v":"N/A"},{"$nulls":4},{"$f":"CEILING(F35*G35*H35*I35,1)","v":{"v":0,"d":"$0"}},null,{"$f":"IF(J35-K35<0,0,J35-K35)","v":{"v":0,"d":"$0"}}]
["Total(s)",{"$nulls":8},{"$f":"SUM(J33:J35)","v":{"v":0,"d":"$0"}},{"$f":"SUM(K33:K35)","v":{"v":0,"d":"$0"}},{"$f":"SUM(L33:L35)","v":{"v":0,"d":"$0"}}]
["Narrative"]
[]
[]
["D. Equipment"]
["Item",null,null,"Computation"]
["List and describe each item of equipment that will be purchased",null,null,"Compute the cost (e.g., the number of each item to be purchased X the cost per item)"]
[{"$nulls":3},"# of Items",null,"Unit Cost",{"$nulls":3},"Total Cost","Non-Federal Contribution","Federal Request"]
[]
[{"$nulls":9},{"$f":"CEILING(D45*F45,1)","v":{"v":0,"d":"$0"}},null,{"$f":"IF(J45-K45<0,0,J45-K45)","v":{"v":0,"d":"$0"}}]
[{"$nulls":9},{"$f":"CEILING(D46*F46,1)","v":{"v":0,"d":"$0"}},null,{"$f":"IF(J46-K46<0,0,J46-K46)","v":{"v":0,"d":"$0"}}]
[{"$nulls":9},{"$f":"CEILING(D47*F47,1)","v":{"v":0,"d":"$0"}},null,{"$f":"IF(J47-K47<0,0,J47-K47)","v":{"v":0,"d":"$0"}}]
["Total(s)",{"$nulls":8},{"$f":"SUM(J45:J47)","v":{"v":0,"d":"$0"}},{"$f":"SUM(K45:K47)","v":{"v":0,"d":"$0"}},{"$f":"SUM(L45:L47)","v":{"v":0,"d":"$0"}}]
["Narrative"]
[]
[]
["E. Supplies"]
["Supply Items",null,null,"Computation"]
["Provide a list of the types of items to be purchased with grant funds.",null,null,"Describe the item and the compute the costs. Computation: The number of each item to be purchased X the cost per item."]
[{"$nulls":3},"# of Items",null,"Unit Cost",{"$nulls":3},"Total Cost","Non-Federal Contribution","Federal Request"]
[]
[{"$nulls":9},{"$f":"CEILING(D57*F57,1)","v":{"v":0,"d":"$0"}},null,{"$f":"IF(J57-K57<0,0,J57-K57)","v":{"v":0,"d":"$0"}}]
[{"$nulls":9},{"$f":"CEILING(D58*F58,1)","v":{"v":0,"d":"$0"}},null,{"$f":"IF(J58-K58<0,0,J58-K58)","v":{"v":0,"d":"$0"}}]
[{"$nulls":9},{"$f":"CEILING(D59*F59,1)","v":{"v":0,"d":"$0"}},null,{"$f":"IF(J59-K59<0,0,J59-K59)","v":{"v":0,"d":"$0"}}]
["Total(s)",{"$nulls":8},{"$f":"SUM(J57:J59)","v":{"v":0,"d":"$0"}},{"$f":"SUM(K57:K59)","v":{"v":0,"d":"$0"}},{"$f":"SUM(L57:L59)","v":{"v":0,"d":"$0"}}]
["Narrative"]
[]
[]
["F. Construction"]
["Purpose","Description of Work",null,"Computation"]
["Provide the purpose of the construction","Describe the construction project(s)",null,"Compute the costs (e.g., the number of each item to be purchased X the cost per item)"]
[{"$nulls":3},"# of Items",null,"Cost",{"$nulls":3},"Total Cost","Non-Federal Contribution","Federal Request"]
[]
[{"$nulls":9},{"$f":"CEILING(D69*F69,1)","v":{"v":0,"d":"$0"}},null,{"$f":"IF(J69-K69<0,0,J69-K69)","v":{"v":0,"d":"$0"}}]
[{"$nulls":9},{"$f":"CEILING(D70*F70,1)","v":{"v":0,"d":"$0"}},null,{"$f":"IF(J70-K70<0,0,J70-K70)","v":{"v":0,"d":"$0"}}]
[{"$nulls":9},{"$f":"CEILING(D71*F71,1)","v":{"v":0,"d":"$0"}},null,{"$f":"IF(J71-K71<0,0,J71-K71)","v":{"v":0,"d":"$0"}}]
["Total(s)",{"$nulls":8},{"$f":"SUM(J69:J71)","v":{"v":0,"d":"$0"}},{"$f":"SUM(K69:K71)","v":{"v":0,"d":"$0"}},{"$f":"SUM(L69:L71)","v":{"v":0,"d":"$0"}}]
["Narrative"]
[]
[]
["G. Subawards (Subgrants)"]
["Description",null,"Purpose",{"$nulls":4},"Consultant?"]
["Provide a description of the activities to be carried out by subrecipients.",null,"Describe the purpose of the subaward (subgrant)",{"$nulls":4},"Is the subaward for a consultant? If yes, use the section below to explain associated travel expenses included in the cost."]
[{"$nulls":9},"Total Cost","Non-Federal Contribution","Federal Request"]
[]
[{"$nulls":11},{"$f":"IF(J81-K81<0,0,J81-K81)","v":{"v":0,"d":"$0"}}]
[{"$nulls":11},{"$f":"IF(J82-K82<0,0,J82-K82)","v":{"v":0,"d":"$0"}}]
[{"$nulls":11},{"$f":"IF(J83-K83<0,0,J83-K83)","v":{"v":0,"d":"$0"}}]
["Total(s)",{"$nulls":8},{"$f":"SUM(J81:J83)+J93","v":{"v":0,"d":"$0"}},{"$f":"SUM(K81:K83)+K93","v":{"v":0,"d":"$0"}},{"$f":"SUM(L81:L83)+L93","v":{"v":0,"d":"$0"}}]
["Consultant Travel (if necessary)"]
["Purpose of Travel","Location",null,"Type of Expense",null,null,"Computation"]
["Indicate the purpose of each trip or type of trip (training, advisory group meeting)","Indicate the travel destination.",null,"Hotel, airfare, per diem",null,null,"Compute the cost of each type of expense X the number of people traveling."]
[{"$nulls":6},"Cost","Duration or Distance","# of Staff","Total Cost","Non-Federal Contribution","Federal Request"]
[]
[{"$nulls":9},{"$f":"CEILING(G90*H90*I90,1)","v":{"v":0,"d":"$0"}},null,{"$f":"IF(J90-K90<0,0,J90-K90)","v":{"v":0,"d":"$0"}}]
[{"$nulls":9},{"$f":"CEILING(G91*H91*I91,1)","v":{"v":0,"d":"$0"}},null,{"$f":"IF(J91-K91<0,0,J91-K91)","v":{"v":0,"d":"$0"}}]
[{"$nulls":9},{"$f":"CEILING(G92*H92*I92,1)","v":{"v":0,"d":"$0"}},null,{"$f":"IF(J92-K92<0,0,J92-K92)","v":{"v":0,"d":"$0"}}]
["Total",{"$nulls":8},{"$f":"SUM(J90:J92)","v":{"v":0,"d":"$0"}},{"$f":"SUM(K90:K92)","v":{"v":0,"d":"$0"}},{"$f":"SUM(L90:L92)","v":{"v":0,"d":"$0"}}]
["Narrative"]
[]
[]
["H. Procurement Contracts"]
["Description",null,"Purpose",{"$nulls":4},"Consultant?"]
["Provide a description of the products or services to be procured by contract and an estimate of the costs.  Applicants are encouraged to promote free and open competition in awarding contracts.  A separate justification must be provided for sole source procurements in excess of the Simplified Acquisition Threshold (currently $150,000). ",null,"Describe the purpose of the contract",{"$nulls":4},"Is the subaward for a consultant? If yes, use the section below to explain associated travel expenses included in the cost."]
[{"$nulls":9},"Total Cost","Non-Federal Contribution","Federal Request"]
[]
[{"$nulls":11},{"$f":"IF(J102-K102<0,0,J102-K102)","v":{"v":0,"d":"$0"}}]
[{"$nulls":11},{"$f":"IF(J103-K103<0,0,J103-K103)","v":{"v":0,"d":"$0"}}]
[{"$nulls":11},{"$f":"IF(J104-K104<0,0,J104-K104)","v":{"v":0,"d":"$0"}}]
["Total(s)",{"$nulls":8},{"$f":"SUM(J102:J104)+J114","v":{"v":0,"d":"$0"}},{"$f":"SUM(K102:K104)+K114","v":{"v":0,"d":"$0"}},{"$f":"SUM(L102:L104)+L114","v":{"v":0,"d":"$0"}}]
["Consultant Travel (if necessary)"]
["Purpose of Travel","Location",null,"Type of Expense",null,null,"Computation"]
["Indicate the purpose of each trip or type of trip (training, advisory group meeting)","Indicate the travel destination.",null,"Hotel, airfare, per diem",null,null,"Compute the cost of each type of expense X the number of people traveling."]
[{"$nulls":6},"Cost","Duration or Distance","# of Staff","Total Cost","Non-Federal Contribution","Federal Request"]
[]
[{"$nulls":9},{"$f":"CEILING(G111*H111*I111,1)","v":{"v":0,"d":"$0"}},null,{"$f":"IF(J111-K111<0,0,J111-K111)","v":{"v":0,"d":"$0"}}]
[{"$nulls":9},{"$f":"CEILING(G112*H112*I112,1)","v":{"v":0,"d":"$0"}},null,{"$f":"IF(J112-K112<0,0,J112-K112)","v":{"v":0,"d":"$0"}}]
[{"$nulls":9},{"$f":"CEILING(G113*H113*I113,1)","v":{"v":0,"d":"$0"}},null,{"$f":"IF(J113-K113<0,0,J113-K113)","v":{"v":0,"d":"$0"}}]
["Total",{"$nulls":8},{"$f":"SUM(J111:J113)","v":{"v":0,"d":"$0"}},{"$f":"SUM(K111:K113)","v":{"v":0,"d":"$0"}},{"$f":"SUM(L111:L113)","v":{"v":0,"d":"$0"}}]
["Narrative"]
[]
[]
["I. Other Costs"]
["Description ",null,"Computation"]
["List and describe items that will be paid with grants funds (e.g. rent, reproduction, telephone, janitorial, or security services, and investigative or confidential funds).",null,"Show the basis for computation"]
[null,null,"Quantity",null,"Basis","Cost",null,"Length of Time",null,"Total Cost","Non-Federal Contribution","Federal Request"]
[]
[{"$nulls":9},{"$f":"CEILING(C123*F123*H123,1)","v":{"v":0,"d":"$0"}},null,{"$f":"IF(J123-K123<0,0,J123-K123)","v":{"v":0,"d":"$0"}}]
[{"$nulls":9},{"$f":"CEILING(C124*F124*H124,1)","v":{"v":0,"d":"$0"}},null,{"$f":"IF(J124-K124<0,0,J124-K124)","v":{"v":0,"d":"$0"}}]
[{"$nulls":9},{"$f":"CEILING(C125*F125*H125,1)","v":{"v":0,"d":"$0"}},null,{"$f":"IF(J125-K125<0,0,J125-K125)","v":{"v":0,"d":"$0"}}]
["Total(s)",{"$nulls":8},{"$f":"SUM(J123:J125)","v":{"v":0,"d":"$0"}},{"$f":"SUM(K123:K125)","v":{"v":0,"d":"$0"}},{"$f":"SUM(L123:L125)","v":{"v":0,"d":"$0"}}]
["Narrative"]
[]
[]
["J. Indirect Costs"]
["Description",null,null,"Computation"]
["Describe what the approved rate is and how it is applied.",null,null,"Compute the indirect costs for those portions of the program which allow such costs."]
[{"$nulls":3},"Base",null,"Indirect Cost Rate",{"$nulls":3},"Total Cost","Non-Federal Contribution","Federal Request"]
[]
[{"$nulls":9},{"$f":"CEILING(D135*F135,1)","v":{"v":0,"d":"$0"}},null,{"$f":"IF(J135-K135<0,0,J135-K135)","v":{"v":0,"d":"$0"}}]
[{"$nulls":9},{"$f":"CEILING(D136*F136,1)","v":{"v":0,"d":"$0"}},null,{"$f":"IF(J136-K136<0,0,J136-K136)","v":{"v":0,"d":"$0"}}]
[{"$nulls":9},{"$f":"CEILING(D137*F137,1)","v":{"v":0,"d":"$0"}},null,{"$f":"IF(J137-K137<0,0,J137-K137)","v":{"v":0,"d":"$0"}}]
["Total(s)",{"$nulls":8},{"$f":"SUM(J135:J137)","v":{"v":0,"d":"$0"}},{"$f":"SUM(K135:K137)","v":{"v":0,"d":"$0"}},{"$f":"SUM(L135:L137)","v":{"v":0,"d":"$0"}}]
["Narrative"]

{"sheet":"Budget Detail - Year 3","index":4,"n_rows":139,"n_cols":12,"rows_kept":139,"merged":[[0,0,0,5],[0,7,0,11],[1,0,1,9],[1,10,2,11],[2,0,2,1],[4,2,4,11],[5,2,5,11],[6,0,7,1],[6,2,7,3],[6,4,7,4],[6,5,7,6],[6,7,7,8],[6,9,7,9],[6,10,7,10],[6,11,7,11],[8,2,8,3],[8,5,8,6],[8,7,8,8],[9,2,9,3],[9,5,9,6],[9,7,9,8],[10,2,10,3],[10,5,10,6],[10,7,10,8],[11,0,11,8],[13,0,14,11],[16,0,16,2],[16,3,16,11],[17,0,17,2],[17,3,17,11],[18,0,19,2],[18,3,19,4],[18,5,19,8],[18,9,19,9],[18,10,19,10],[18,11,19,11],[20,0,20,2],[20,3,20,4],[20,5,20,8],[21,0,21,2],[21,3,21,4],[21,5,21,8],[22,0,22,2],[22,3,22,4],[22,5,22,8],[23,0,23,8],[25,0,26,11],[28,1,28,2],[28,5,28,11],[29,1,29,2],[29,5,29,11],[30,0,31,4],[30,5,31,5],[30,6,31,6],[30,7,31,7],[30,8,31,8],[30,9,31,9],[30,10,31,10],[30,11,31,11],[32,1,32,2],[33,1,33,2],[34,1,34,2],[35,0,35,8],[37,0,38,11],[40,0,40,2],[40,3,40,11],[41,0,41,2],[41,3,41,11],[42,0,43,2],[42,3,43,4],[42,5,43,8],[42,9,43,9],[42,10,43,10],[42,11,43,11],[44,0,44,2],[44,3,44,4],[44,5,44,8],[45,0,45,2],[45,3,45,4],[45,5,45,8],[46,0,46,2],[46,3,46,4],[46,5,46,8],[47,0,47,8],[49,0,50,11],[52,0,52,2],[52,3,52,11],[53,0,53,2],[53,3,53,11],[54,0,55,2],[54,3,55,4],[54,5,55,8],[54,9,55,9],[54,10,55,10],[54,11,55,11],[56,0,56,2],[56,3,56,4],[56,5,56,8],[57,0,57,2],[57,3,57,4],[57,5,57,8],[58,0,58,2],[58,3,58,4],[58,5,58,8],[59,0,59,8],[61,0,62,11],[64,1,64,2],[64,3,64,11],[65,1,65,2],[65,3,65,11],[66,0,67,2],[66,3,67,4],[66,5,67,8],[66,9,67,9],[66,10,67,10],[66,11,67,11],[68,1,68,2],[68,3,68,4],[68,5,68,8],[69,1,69,2],[69,3,69,4],[69,5,69,8],[70,1,70,2],[70,3,70,4],[70,5,70,8],[71,0,71,8],[73,0,74,11],[75,0,75,1],[76,0,76,1],[76,2,76,6],[76,7,76,8],[76,9,77,11],[77,0,77,1],[77,2,77,6],[77,7,77,8],[78,9,79,9],[78,10,79,10],[78,11,79,11],[80,0,80,1],[80,2,80,6],[80,7,80,8],[81,0,81,1],[81,2,81,6],[81,7,81,8],[82,0,82,1],[82,2,82,6],[82,7,82,8],[83,0,83,8],[84,0,84,1],[85,1,85,2],[85,3,85,5],[85,6,85,11],[86,1,86,2],[86,3,86,5],[86,6,86,11],[87,0,88,5],[87,6,88,6],[87,7,88,7],[87,8,88,8],[87,9,88,9],[87,10,88,10],[87,11,88,11],[89,1,89,2],[89,3,89,5],[90,1,90,2],[90,3,90,5],[91,1,91,2],[91,3,91,5],[92,0,92,8],[94,0,95,11],[96,0,96,1],[97,0,97,1],[97,2,97,6],[97,7,97,8],[98,0,98,1],[98,2,98,6],[98,7,98,8],[99,0,100,1],[99,9,100,9],[99,10,100,10],[99,11,100,11],[101,0,101,1],[101,2,101,6],[101,7,101,8],[102,0,102,1],[102,2,102,6],[102,7,102,8],[103,0,103,1],[103,2,103,6],[103,7,103,8],[104,0,104,8],[105,0,105,1],[106,1,106,2],[106,3,106,5],[106,6,106,11],[107,1,107,2],[107,3,107,5],[107,6,107,11],[108,0,109,5],[108,6,109,6],[108,7,109,7],[108,8,109,8],[108,9,109,9],[108,10,109,10],[108,11,109,11],[110,1,110,2],[110,3,110,5],[111,1,111,2],[111,3,111,5],[112,1,112,2],[112,3,112,5],[113,0,113,8],[115,0,116,11],[118,0,118,1],[118,2,118,11],[119,0,119,1],[119,2,119,11],[120,2,121,3],[120,4,121,4],[120,5,121,6],[120,7,121,8],[120,9,121,9],[120,10,121,10],[120,11,121,11],[122,0,122,1],[122,2,122,3],[122,5,122,6],[122,7,122,8],[123,0,123,1],[123,2,123,3],[123,5,123,6],[123,7,123,8],[124,0,124,1],[124,2,124,3],[124,5,124,6],[124,7,124,8],[125,0,125,8],[127,0,128,11],[130,0,130,2],[130,3,130,11],[131,0,131,2],[131,3,131,11],[132,0,133,2],[132,3,133,4],[132,5,133,8],[132,9,133,9],[132,10,133,10],[132,11,133,11],[134,0,134,2],[134,3,134,4],[134,5,134,8],[135,0,135,2],[135,3,135,4],[135,5,135,8],[136,0,136,2],[136,3,136,4],[136,5,136,8],[137,0,137,8],[139,0,140,11]]}
[{"$f":"'Budget Sheet Instructions'!A19","v":"Budget Detail - Year 3"}]
["Does this budget contain conference costs which is defined broadly to include meetings, retreats, seminars, symposia, and training activities? - Y/N"]
["(DOJ Financial Guide, Section 3.10)"]
["A. Personnel"]
["Name","Position","Computation"]
["List each name, if known.","List each position, if known.","Show annual salary rate & amount of time devoted to the project for each name/position."]
[null,null,"Salary ",null,"Rate","Time Worked\n(# of hours, days, months, years)",null,"Percentage of Time",null,"Total Cost","Non-Federal Contribution","Federal Request"]
[]
[{"$nulls":9},{"$f":"CEILING(C9*F9*H9,1)","v":{"v":0,"d":"$0"}},null,{"$f":"IF(J9-K9<0,0,J9-K9)","v":{"v":0,"d":"$0"}}]
[{"$nulls":9},{"$f":"CEILING(C10*F10*H10,1)","v":{"v":0,"d":"$0"}},null,{"$f":"IF(J10-K10<0,0,J10-K10)","v":{"v":0,"d":"$0"}}]
[{"$nulls":9},{"$f":"CEILING(C11*F11*H11,1)","v":{"v":0,"d":"$0"}},null,{"$f":"IF(J11-K11<0,0,J11-K11)","v":{"v":0,"d":"$0"}}]
["Total(s)",{"$nulls":8},{"$f":"SUM(J9:J11)","v":{"v":0,"d":"$0"}},{"$f":"SUM(K9:K11)","v":{"v":0,"d":"$0"}},{"$f":"SUM(L9:L11)","v":{"v":0,"d":"$0"}}]
["Narrative"]
[]
[]
["B. Fringe Benefits"]
["Name",null,null,"Computation"]
["List each grant-supported position receiving fringe benefits.",null,null,"Show the basis for computation."]
[{"$nulls":3},"Base",null,"Rate",{"$nulls":3},"Total Cost","Non-Federal Contribution","Federal Request"]
[]
[{"$nulls":9},{"$f":"CEILING(D21*F21,1)","v":{"v":0,"d":"$0"}},null,{"$f":"IF(J21-K21<0,0,J21-K21)","v":{"v":0,"d":"$0"}}]
[{"$nulls":9},{"$f":"CEILING(D22*F22,1)","v":{"v":0,"d":"$0"}},null,{"$f":"IF(J22-K22<0,0,J22-K22)","v":{"v":0,"d":"$0"}}]
[{"$nulls":9},{"$f":"CEILING(D23*F23,1)","v":{"v":0,"d":"$0"}},null,{"$f":"IF(J23-K23<0,0,J23-K23)","v":{"v":0,"d":"$0"}}]
["Total(s)",{"$nulls":8},{"$f":"SUM(J21:J23)","v":{"v":0,"d":"$0"}},{"$f":"SUM(K21:K23)","v":{"v":0,"d":"$0"}},{"$f":"SUM(L21:L23)","v":{"v":0,"d":"$0"}}]
["Narrative"]
[]
[]
["C. Travel"]
["Purpose of Travel","Location",null,"Type of Expense","Basis","Computation"]
["Indicate the purpose of each trip or type of trip (training, advisory group meeting)","Indicate the travel destination.",null,"Lodging, Meals, Etc.","Per day, mile, trip, Etc.","Compute the cost of each type of expense X the number of people traveling."]
[{"$nulls":5},"Cost","Quantity","# of Staff","# of Trips","Total Cost","Non-Federal Contribution","Federal Request"]
[]
[{"$nulls":4},{"$f":"IF((D33=\"Lodging\"),\"Night\",IF((D33=\"Meals\"),\"Day\",IF((D33=\"Mileage\"),\"Mile\",IF((D33=\"Transportation\"),\"Round-trip\",\"N/A\"))))","v":"N/A"},{"$nulls":4},{"$f":"CEILING(F33*G33*H33*I33,1)","v":{"v":0,"d":"$0"}},null,{"$f":"IF(J33-K33<0,0,J33-K33)","v":{"v":0,"d":"$0"}}]
[{"$nulls":4},{"$f":"IF((D34=\"Lodging\"),\"Night\",IF((D34=\"Meals\"),\"Day\",IF((D34=\"Mileage\"),\"Mile\",IF((D34=\"Transportation\"),\"Round-trip\",\"N/A\"))))","v":"N/A"},{"$nulls":4},{"$f":"CEILING(F34*G34*H34*I34,1)","v":{"v":0,"d":"$0"}},null,{"$f":"IF(J34-K34<0,0,J34-K34)","v":{"v":0,"d":"$0"}}]
[{"$nulls":4},{"$f":"IF((D35=\"Lodging\"),\"Night\",IF((D35=\"Meals\"),\"Day\",IF((D35=\"Mileage\"),\"Mile\",IF((D35=\"Transportation\"),\"Round-trip\",\"N/A\"))))","v":"N/A"},{"$nulls":4},{"$f":"CEILING(F35*G35*H35*I35,1)","v":{"v":0,"d":"$0"}},null,{"$f":"IF(J35-K35<0,0,J35-K35)","v":{"v":0,"d":"$0"}}]
["Total(s)",{"$nulls":8},{"$f":"SUM(J33:J35)","v":{"v":0,"d":"$0"}},{"$f":"SUM(K33:K35)","v":{"v":0,"d":"$0"}},{"$f":"SUM(L33:L35)","v":{"v":0,"d":"$0"}}]
["Narrative"]
[]
[]
["D. Equipment"]
["Item",null,null,"Computation"]
["List and describe each item of equipment that will be purchased",null,null,"Compute the cost (e.g., the number of each item to be purchased X the cost per item)"]
[{"$nulls":3},"# of Items",null,"Unit Cost",{"$nulls":3},"Total Cost","Non-Federal Contribution","Federal Request"]
[]
[{"$nulls":9},{"$f":"CEILING(D45*F45,1)","v":{"v":0,"d":"$0"}},null,{"$f":"IF(J45-K45<0,0,J45-K45)","v":{"v":0,"d":"$0"}}]
[{"$nulls":9},{"$f":"CEILING(D46*F46,1)","v":{"v":0,"d":"$0"}},null,{"$f":"IF(J46-K46<0,0,J46-K46)","v":{"v":0,"d":"$0"}}]
[{"$nulls":9},{"$f":"CEILING(D47*F47,1)","v":{"v":0,"d":"$0"}},null,{"$f":"IF(J47-K47<0,0,J47-K47)","v":{"v":0,"d":"$0"}}]
["Total(s)",{"$nulls":8},{"$f":"SUM(J45:J47)","v":{"v":0,"d":"$0"}},{"$f":"SUM(K45:K47)","v":{"v":0,"d":"$0"}},{"$f":"SUM(L45:L47)","v":{"v":0,"d":"$0"}}]
["Narrative"]
[]
[]
["E. Supplies"]
["Supply Items",null,null,"Computation"]
["Provide a list of the types of items to be purchased with grant funds.",null,null,"Describe the item and the compute the costs. Computation: The number of each item to be purchased X the cost per item."]
[{"$nulls":3},"# of Items",null,"Unit Cost",{"$nulls":3},"Total Cost","Non-Federal Contribution","Federal Request"]
[]
[{"$nulls":9},{"$f":"CEILING(D57*F57,1)","v":{"v":0,"d":"$0"}},null,{"$f":"IF(J57-K57<0,0,J57-K57)","v":{"v":0,"d":"$0"}}]
[{"$nulls":9},{"$f":"CEILING(D58*F58,1)","v":{"v":0,"d":"$0"}},null,{"$f":"IF(J58-K58<0,0,J58-K58)","v":{"v":0,"d":"$0"}}]
[{"$nulls":9},{"$f":"CEILING(D59*F59,1)","v":{"v":0,"d":"$0"}},null,{"$f":"IF(J59-K59<0,0,J59-K59)","v":{"v":0,"d":"$0"}}]
["Total(s)",{"$nulls":8},{"$f":"SUM(J57:J59)","v":{"v":0,"d":"$0"}},{"$f":"SUM(K57:K59)","v":{"v":0,"d":"$0"}},{"$f":"SUM(L57:L59)","v":{"v":0,"d":"$0"}}]
["Narrative"]
[]
[]
["F. Construction"]
["Purpose","Description of Work",null,"Computation"]
["Provide the purpose of the construction","Describe the construction project(s)",null,"Compute the costs (e.g., the number of each item to be purchased X the cost per item)"]
[{"$nulls":3},"# of Items",null,"Cost",{"$nulls":3},"Total Cost","Non-Federal Contribution","Federal Request"]
[]
[{"$nulls":9},{"$f":"CEILING(D69*F69,1)","v":{"v":0,"d":"$0"}},null,{"$f":"IF(J69-K69<0,0,J69-K69)","v":{"v":0,"d":"$0"}}]
[{"$nulls":9},{"$f":"CEILING(D70*F70,1)","v":{"v":0,"d":"$0"}},null,{"$f":"IF(J70-K70<0,0,J70-K70)","v":{"v":0,"d":"$0"}}]
[{"$nulls":9},{"$f":"CEILING(D71*F71,1)","v":{"v":0,"d":"$0"}},null,{"$f":"IF(J71-K71<0,0,J71-K71)","v":{"v":0,"d":"$0"}}]
["Total(s)",{"$nulls":8},{"$f":"SUM(J69:J71)","v":{"v":0,"d":"$0"}},{"$f":"SUM(K69:K71)","v":{"v":0,"d":"$0"}},{"$f":"SUM(L69:L71)","v":{"v":0,"d":"$0"}}]
["Narrative"]
[]
[]
["G. Subawards (Subgrants)"]
["Description",null,"Purpose",{"$nulls":4},"Consultant?"]
["Provide a description of the activities to be carried out by subrecipients.",null,"Describe the purpose of the subaward (subgrant)",{"$nulls":4},"Is the subaward for a consultant? If yes, use the section below to explain associated travel expenses included in the cost."]
[{"$nulls":9},"Total Cost","Non-Federal Contribution","Federal Request"]
[]
[{"$nulls":11},{"$f":"IF(J81-K81<0,0,J81-K81)","v":{"v":0,"d":"$0"}}]
[{"$nulls":11},{"$f":"IF(J82-K82<0,0,J82-K82)","v":{"v":0,"d":"$0"}}]
[{"$nulls":11},{"$f":"IF(J83-K83<0,0,J83-K83)","v":{"v":0,"d":"$0"}}]
["Total(s)",{"$nulls":8},{"$f":"SUM(J81:J83)+J93","v":{"v":0,"d":"$0"}},{"$f":"SUM(K81:K83)+K93","v":{"v":0,"d":"$0"}},{"$f":"SUM(L81:L83)+L93","v":{"v":0,"d":"$0"}}]
["Consultant Travel (if necessary)"]
["Purpose of Travel","Location",null,"Type of Expense",null,null,"Computation"]
["Indicate the purpose of each trip or type of trip (training, advisory group meeting)","Indicate the travel destination.",null,"Hotel, airfare, per diem",null,null,"Compute the cost of each type of expense X the number of people traveling."]
[{"$nulls":6},"Cost","Duration or Distance","# of Staff","Total Cost","Non-Federal Contribution","Federal Request"]
[]
[{"$nulls":9},{"$f":"CEILING(G90*H90*I90,1)","v":{"v":0,"d":"$0"}},null,{"$f":"IF(J90-K90<0,0,J90-K90)","v":{"v":0,"d":"$0"}}]
[{"$nulls":9},{"$f":"CEILING(G91*H91*I91,1)","v":{"v":0,"d":"$0"}},null,{"$f":"IF(J91-K91<0,0,J91-K91)","v":{"v":0,"d":"$0"}}]
[{"$nulls":9},{"$f":"CEILING(G92*H92*I92,1)","v":{"v":0,"d":"$0"}},null,{"$f":"IF(J92-K92<0,0,J92-K92)","v":{"v":0,"d":"$0"}}]
["Total",{"$nulls":8},{"$f":"SUM(J90:J92)","v":{"v":0,"d":"$0"}},{"$f":"SUM(K90:K92)","v":{"v":0,"d":"$0"}},{"$f":"SUM(L90:L92)","v":{"v":0,"d":"$0"}}]
["Narrative"]
[]
[]
["H. Procurement Contracts"]
["Description",null,"Purpose",{"$nulls":4},"Consultant?"]
["Provide a description of the products or services to be procured by contract and an estimate of the costs.  Applicants are encouraged to promote free and open competition in awarding contracts.  A separate justification must be provided for sole source procurements in excess of the Simplified Acquisition Threshold (currently $150,000). ",null,"Describe the purpose of the contract",{"$nulls":4},"Is the subaward for a consultant? If yes, use the section below to explain associated travel expenses included in the cost."]
[{"$nulls":9},"Total Cost","Non-Federal Contribution","Federal Request"]
[]
[{"$nulls":11},{"$f":"IF(J102-K102<0,0,J102-K102)","v":{"v":0,"d":"$0"}}]
[{"$nulls":11},{"$f":"IF(J103-K103<0,0,J103-K103)","v":{"v":0,"d":"$0"}}]
[{"$nulls":11},{"$f":"IF(J104-K104<0,0,J104-K104)","v":{"v":0,"d":"$0"}}]
["Total(s)",{"$nulls":8},{"$f":"SUM(J102:J104)+J114","v":{"v":0,"d":"$0"}},{"$f":"SUM(K102:K104)+K114","v":{"v":0,"d":"$0"}},{"$f":"SUM(L102:L104)+L114","v":{"v":0,"d":"$0"}}]
["Consultant Travel (if necessary)"]
["Purpose of Travel","Location",null,"Type of Expense",null,null,"Computation"]
["Indicate the purpose of each trip or type of trip (training, advisory group meeting)","Indicate the travel destination.",null,"Hotel, airfare, per diem",null,null,"Compute the cost of each type of expense X the number of people traveling."]
[{"$nulls":6},"Cost","Duration or Distance","# of Staff","Total Cost","Non-Federal Contribution","Federal Request"]
[]
[{"$nulls":9},{"$f":"CEILING(G111*H111*I111,1)","v":{"v":0,"d":"$0"}},null,{"$f":"IF(J111-K111<0,0,J111-K111)","v":{"v":0,"d":"$0"}}]
[{"$nulls":9},{"$f":"CEILING(G112*H112*I112,1)","v":{"v":0,"d":"$0"}},null,{"$f":"IF(J112-K112<0,0,J112-K112)","v":{"v":0,"d":"$0"}}]
[{"$nulls":9},{"$f":"CEILING(G113*H113*I113,1)","v":{"v":0,"d":"$0"}},null,{"$f":"IF(J113-K113<0,0,J113-K113)","v":{"v":0,"d":"$0"}}]
["Total",{"$nulls":8},{"$f":"SUM(J111:J113)","v":{"v":0,"d":"$0"}},{"$f":"SUM(K111:K113)","v":{"v":0,"d":"$0"}},{"$f":"SUM(L111:L113)","v":{"v":0,"d":"$0"}}]
["Narrative"]
[]
[]
["I. Other Costs"]
["Description ",null,"Computation"]
["List and describe items that will be paid with grants funds (e.g. rent, reproduction, telephone, janitorial, or security services, and investigative or confidential funds).",null,"Show the basis for computation"]
[null,null,"Quantity",null,"Basis","Cost",null,"Length of Time",null,"Total Cost","Non-Federal Contribution","Federal Request"]
[]
[{"$nulls":9},{"$f":"CEILING(C123*F123*H123,1)","v":{"v":0,"d":"$0"}},null,{"$f":"IF(J123-K123<0,0,J123-K123)","v":{"v":0,"d":"$0"}}]
[{"$nulls":9},{"$f":"CEILING(C124*F124*H124,1)","v":{"v":0,"d":"$0"}},null,{"$f":"IF(J124-K124<0,0,J124-K124)","v":{"v":0,"d":"$0"}}]
[{"$nulls":9},{"$f":"CEILING(C125*F125*H125,1)","v":{"v":0,"d":"$0"}},null,{"$f":"IF(J125-K125<0,0,J125-K125)","v":{"v":0,"d":"$0"}}]
["Total(s)",{"$nulls":8},{"$f":"SUM(J123:J125)","v":{"v":0,"d":"$0"}},{"$f":"SUM(K123:K125)","v":{"v":0,"d":"$0"}},{"$f":"SUM(L123:L125)","v":{"v":0,"d":"$0"}}]
["Narrative"]
[]
[]
["J. Indirect Costs"]
["Description",null,null,"Computation"]
["Describe what the approved rate is and how it is applied.",null,null,"Compute the indirect costs for those portions of the program which allow such costs."]
[{"$nulls":3},"Base",null,"Indirect Cost Rate",{"$nulls":3},"Total Cost","Non-Federal Contribution","Federal Request"]
[]
[{"$nulls":9},{"$f":"CEILING(D135*F135,1)","v":{"v":0,"d":"$0"}},null,{"$f":"IF(J135-K135<0,0,J135-K135)","v":{"v":0,"d":"$0"}}]
[{"$nulls":9},{"$f":"CEILING(D136*F136,1)","v":{"v":0,"d":"$0"}},null,{"$f":"IF(J136-K136<0,0,J136-K136)","v":{"v":0,"d":"$0"}}]
[{"$nulls":9},{"$f":"CEILING(D137*F137,1)","v":{"v":0,"d":"$0"}},null,{"$f":"IF(J137-K137<0,0,J137-K137)","v":{"v":0,"d":"$0"}}]
["Total(s)",{"$nulls":8},{"$f":"SUM(J135:J137)","v":{"v":0,"d":"$0"}},{"$f":"SUM(K135:K137)","v":{"v":0,"d":"$0"}},{"$f":"SUM(L135:L137)","v":{"v":0,"d":"$0"}}]
["Narrative"]

{"sheet":"Budget Detail - Year 4","index":5,"n_rows":139,"n_cols":12,"rows_kept":139,"merged":[[0,0,0,5],[0,7,0,11],[1,0,1,9],[1,10,2,11],[2,0,2,1],[4,2,4,11],[5,2,5,11],[6,0,7,1],[6,2,7,3],[6,4,7,4],[6,5,7,6],[6,7,7,8],[6,9,7,9],[6,10,7,10],[6,11,7,11],[8,2,8,3],[8,5,8,6],[8,7,8,8],[9,2,9,3],[9,5,9,6],[9,7,9,8],[10,2,10,3],[10,5,10,6],[10,7,10,8],[11,0,11,8],[13,0,14,11],[16,0,16,2],[16,3,16,11],[17,0,17,2],[17,3,17,11],[18,0,19,2],[18,3,19,4],[18,5,19,8],[18,9,19,9],[18,10,19,10],[18,11,19,11],[20,0,20,2],[20,3,20,4],[20,5,20,8],[21,0,21,2],[21,3,21,4],[21,5,21,8],[22,0,22,2],[22,3,22,4],[22,5,22,8],[23,0,23,8],[25,0,26,11],[28,1,28,2],[28,5,28,11],[29,1,29,2],[29,5,29,11],[30,0,31,4],[30,5,31,5],[30,6,31,6],[30,7,31,7],[30,8,31,8],[30,9,31,9],[30,10,31,10],[30,11,31,11],[32,1,32,2],[33,1,33,2],[34,1,34,2],[35,0,35,8],[37,0,38,11],[40,0,40,2],[40,3,40,11],[41,0,41,2],[41,3,41,11],[42,0,43,2],[42,3,43,4],[42,5,43,8],[42,9,43,9],[42,10,43,10],[42,11,43,11],[44,0,44,2],[44,3,44,4],[44,5,44,8],[45,0,45,2],[45,3,45,4],[45,5,45,8],[46,0,46,2],[46,3,46,4],[46,5,46,8],[47,0,47,8],[49,0,50,11],[52,0,52,2],[52,3,52,11],[53,0,53,2],[53,3,53,11],[54,0,55,2],[54,3,55,4],[54,5,55,8],[54,9,55,9],[54,10,55,10],[54,11,55,11],[56,0,56,2],[56,3,56,4],[56,5,56,8],[57,0,57,2],[57,3,57,4],[57,5,57,8],[58,0,58,2],[58,3,58,4],[58,5,58,8],[59,0,59,8],[61,0,62,11],[64,1,64,2],[64,3,64,11],[65,1,65,2],[65,3,65,11],[66,0,67,2],[66,3,67,4],[66,5,67,8],[66,9,67,9],[66,10,67,10],[66,11,67,11],[68,1,68,2],[68,3,68,4],[68,5,68,8],[69,1,69,2],[69,3,69,4],[69,5,69,8],[70,1,70,2],[70,3,70,4],[70,5,70,8],[71,0,71,8],[73,0,74,11],[75,0,75,1],[76,0,76,1],[76,2,76,6],[76,7,76,8],[76,9,77,11],[77,0,77,1],[77,2,77,6],[77,7,77,8],[78,9,79,9],[78,10,79,10],[78,11,79,11],[80,0,80,1],[80,2,80,6],[80,7,80,8],[81,0,81,1],[81,2,81,6],[81,7,81,8],[82,0,82,1],[82,2,82,6],[82,7,82,8],[83,0,83,8],[84,0,84,1],[85,1,85,2],[85,3,85,5],[85,6,85,11],[86,1,86,2],[86,3,86,5],[86,6,86,11],[87,0,88,5],[87,6,88,6],[87,7,88,7],[87,8,88,8],[87,9,88,9],[87,10,88,10],[87,11,88,11],[89,1,89,2],[89,3,89,5],[90,1,90,2],[90,3,90,5],[91,1,91,2],[91,3,91,5],[92,0,92,8],[94,0,95,11],[96,0,96,1],[97,0,97,1],[97,2,97,6],[97,7,97,8],[98,0,98,1],[98,2,98,6],[98,7,98,8],[99,0,100,1],[99,9,100,9],[99,10,100,10],[99,11,100,11],[101,0,101,1],[101,2,101,6],[101,7,101,8],[102,0,102,1],[102,2,102,6],[102,7,102,8],[103,0,103,1],[103,2,103,6],[103,7,103,8],[104,0,104,8],[105,0,105,1],[106,1,106,2],[106,3,106,5],[106,6,106,11],[107,1,107,2],[107,3,107,5],[107,6,107,11],[108,0,109,5],[108,6,109,6],[108,7,109,7],[108,8,109,8],[108,9,109,9],[108,10,109,10],[108,11,109,11],[110,1,110,2],[110,3,110,5],[111,1,111,2],[111,3,111,5],[112,1,112,2],[112,3,112,5],[113,0,113,8],[115,0,116,11],[118,0,118,1],[118,2,118,11],[119,0,119,1],[119,2,119,11],[120,2,121,3],[120,4,121,4],[120,5,121,6],[120,7,121,8],[120,9,121,9],[120,10,121,10],[120,11,121,11],[122,0,122,1],[122,2,122,3],[122,5,122,6],[122,7,122,8],[123,0,123,1],[123,2,123,3],[123,5,123,6],[123,7,123,8],[124,0,124,1],[124,2,124,3],[124,5,124,6],[124,7,124,8],[125,0,125,8],[127,0,128,11],[130,0,130,2],[130,3,130,11],[131,0,131,2],[131,3,131,11],[132,0,133,2],[132,3,133,4],[132,5,133,8],[132,9,133,9],[132,10,133,10],[132,11,133,11],[134,0,134,2],[134,3,134,4],[134,5,134,8],[135,0,135,2],[135,3,135,4],[135,5,135,8],[136,0,136,2],[136,3,136,4],[136,5,136,8],[137,0,137,8],[139,0,140,11]]}
[{"$f":"'Budget Sheet Instructions'!A20","v":"Budget Detail - Year 4"}]
["Does this budget contain conference costs which is defined broadly to include meetings, retreats, seminars, symposia, and training activities? - Y/N"]
["(DOJ Financial Guide, Section 3.10)"]
["A. Personnel"]
["Name","Position","Computation"]
["List each name, if known.","List each position, if known.","Show annual salary rate & amount of time devoted to the project for each name/position."]
[null,null,"Salary ",null,"Rate","Time Worked\n(# of hours, days, months, years)",null,"Percentage of Time",null,"Total Cost","Non-Federal Contribution","Federal Request"]
[]
[{"$nulls":9},{"$f":"CEILING(C9*F9*H9,1)","v":{"v":0,"d":"$0"}},null,{"$f":"IF(J9-K9<0,0,J9-K9)","v":{"v":0,"d":"$0"}}]
[{"$nulls":9},{"$f":"CEILING(C10*F10*H10,1)","v":{"v":0,"d":"$0"}},null,{"$f":"IF(J10-K10<0,0,J10-K10)","v":{"v":0,"d":"$0"}}]
[{"$nulls":9},{"$f":"CEILING(C11*F11*H11,1)","v":{"v":0,"d":"$0"}},null,{"$f":"IF(J11-K11<0,0,J11-K11)","v":{"v":0,"d":"$0"}}]
["Total(s)",{"$nulls":8},{"$f":"SUM(J9:J11)","v":{"v":0,"d":"$0"}},{"$f":"SUM(K9:K11)","v":{"v":0,"d":"$0"}},{"$f":"SUM(L9:L11)","v":{"v":0,"d":"$0"}}]
["Narrative"]
[]
[]
["B. Fringe Benefits"]
["Name",null,null,"Computation"]
["List each grant-supported position receiving fringe benefits.",null,null,"Show the basis for computation."]
[{"$nulls":3},"Base",null,"Rate",{"$nulls":3},"Total Cost","Non-Federal Contribution","Federal Request"]
[]
[{"$nulls":9},{"$f":"CEILING(D21*F21,1)","v":{"v":0,"d":"$0"}},null,{"$f":"IF(J21-K21<0,0,J21-K21)","v":{"v":0,"d":"$0"}}]
[{"$nulls":9},{"$f":"CEILING(D22*F22,1)","v":{"v":0,"d":"$0"}},null,{"$f":"IF(J22-K22<0,0,J22-K22)","v":{"v":0,"d":"$0"}}]
[{"$nulls":9},{"$f":"CEILING(D23*F23,1)","v":{"v":0,"d":"$0"}},null,{"$f":"IF(J23-K23<0,0,J23-K23)","v":{"v":0,"d":"$0"}}]
["Total(s)",{"$nulls":8},{"$f":"SUM(J21:J23)","v":{"v":0,"d":"$0"}},{"$f":"SUM(K21:K23)","v":{"v":0,"d":"$0"}},{"$f":"SUM(L21:L23)","v":{"v":0,"d":"$0"}}]
["Narrative"]
[]
[]
["C. Travel"]
["Purpose of Travel","Location",null,"Type of Expense","Basis","Computation"]
["Indicate the purpose of each trip or type of trip (training, advisory group meeting)","Indicate the travel destination.",null,"Lodging, Meals, Etc.","Per day, mile, trip, Etc.","Compute the cost of each type of expense X the number of people traveling."]
[{"$nulls":5},"Cost","Quantity","# of Staff","# of Trips","Total Cost","Non-Federal Contribution","Federal Request"]
[]
[{"$nulls":4},{"$f":"IF((D33=\"Lodging\"),\"Night\",IF((D33=\"Meals\"),\"Day\",IF((D33=\"Mileage\"),\"Mile\",IF((D33=\"Transportation\"),\"Round-trip\",\"N/A\"))))","v":"N/A"},{"$nulls":4},{"$f":"CEILING(F33*G33*H33*I33,1)","v":{"v":0,"d":"$0"}},null,{"$f":"IF(J33-K33<0,0,J33-K33)","v":{"v":0,"d":"$0"}}]
[{"$nulls":4},{"$f":"IF((D34=\"Lodging\"),\"Night\",IF((D34=\"Meals\"),\"Day\",IF((D34=\"Mileage\"),\"Mile\",IF((D34=\"Transportation\"),\"Round-trip\",\"N/A\"))))","v":"N/A"},{"$nulls":4},{"$f":"CEILING(F34*G34*H34*I34,1)","v":{"v":0,"d":"$0"}},null,{"$f":"IF(J34-K34<0,0,J34-K34)","v":{"v":0,"d":"$0"}}]
[{"$nulls":4},{"$f":"IF((D35=\"Lodging\"),\"Night\",IF((D35=\"Meals\"),\"Day\",IF((D35=\"Mileage\"),\"Mile\",IF((D35=\"Transportation\"),\"Round-trip\",\"N/A\"))))","v":"N/A"},{"$nulls":4},{"$f":"CEILING(F35*G35*H35*I35,1)","v":{"v":0,"d":"$0"}},null,{"$f":"IF(J35-K35<0,0,J35-K35)","v":{"v":0,"d":"$0"}}]
["Total(s)",{"$nulls":8},{"$f":"SUM(J33:J35)","v":{"v":0,"d":"$0"}},{"$f":"SUM(K33:K35)","v":{"v":0,"d":"$0"}},{"$f":"SUM(L33:L35)","v":{"v":0,"d":"$0"}}]
["Narrative"]
[]
[]
["D. Equipment"]
["Item",null,null,"Computation"]
["List and describe each item of equipment that will be purchased",null,null,"Compute the cost (e.g., the number of each item to be purchased X the cost per item)"]
[{"$nulls":3},"# of Items",null,"Unit Cost",{"$nulls":3},"Total Cost","Non-Federal Contribution","Federal Request"]
[]
[{"$nulls":9},{"$f":"CEILING(D45*F45,1)","v":{"v":0,"d":"$0"}},null,{"$f":"IF(J45-K45<0,0,J45-K45)","v":{"v":0,"d":"$0"}}]
[{"$nulls":9},{"$f":"CEILING(D46*F46,1)","v":{"v":0,"d":"$0"}},null,{"$f":"IF(J46-K46<0,0,J46-K46)","v":{"v":0,"d":"$0"}}]
[{"$nulls":9},{"$f":"CEILING(D47*F47,1)","v":{"v":0,"d":"$0"}},null,{"$f":"IF(J47-K47<0,0,J47-K47)","v":{"v":0,"d":"$0"}}]
["Total(s)",{"$nulls":8},{"$f":"SUM(J45:J47)","v":{"v":0,"d":"$0"}},{"$f":"SUM(K45:K47)","v":{"v":0,"d":"$0"}},{"$f":"SUM(L45:L47)","v":{"v":0,"d":"$0"}}]
["Narrative"]
[]
[]
["E. Supplies"]
["Supply Items",null,null,"Computation"]
["Provide a list of the types of items to be purchased with grant funds.",null,null,"Describe the item and the compute the costs. Computation: The number of each item to be purchased X the cost per item."]
[{"$nulls":3},"# of Items",null,"Unit Cost",{"$nulls":3},"Total Cost","Non-Federal Contribution","Federal Request"]
[]
[{"$nulls":9},{"$f":"CEILING(D57*F57,1)","v":{"v":0,"d":"$0"}},null,{"$f":"IF(J57-K57<0,0,J57-K57)","v":{"v":0,"d":"$0"}}]
[{"$nulls":9},{"$f":"CEILING(D58*F58,1)","v":{"v":0,"d":"$0"}},null,{"$f":"IF(J58-K58<0,0,J58-K58)","v":{"v":0,"d":"$0"}}]
[{"$nulls":9},{"$f":"CEILING(D59*F59,1)","v":{"v":0,"d":"$0"}},null,{"$f":"IF(J59-K59<0,0,J59-K59)","v":{"v":0,"d":"$0"}}]
["Total(s)",{"$nulls":8},{"$f":"SUM(J57:J59)","v":{"v":0,"d":"$0"}},{"$f":"SUM(K57:K59)","v":{"v":0,"d":"$0"}},{"$f":"SUM(L57:L59)","v":{"v":0,"d":"$0"}}]
["Narrative"]
[]
[]
["F. Construction"]
["Purpose","Description of Work",null,"Computation"]
["Provide the purpose of the construction","Describe the construction project(s)",null,"Compute the costs (e.g., the number of each item to be purchased X the cost per item)"]
[{"$nulls":3},"# of Items",null,"Cost",{"$nulls":3},"Total Cost","Non-Federal Contribution","Federal Request"]
[]
[{"$nulls":9},{"$f":"CEILING(D69*F69,1)","v":{"v":0,"d":"$0"}},null,{"$f":"IF(J69-K69<0,0,J69-K69)","v":{"v":0,"d":"$0"}}]
[{"$nulls":9},{"$f":"CEILING(D70*F70,1)","v":{"v":0,"d":"$0"}},null,{"$f":"IF(J70-K70<0,0,J70-K70)","v":{"v":0,"d":"$0"}}]
[{"$nulls":9},{"$f":"CEILING(D71*F71,1)","v":{"v":0,"d":"$0"}},null,{"$f":"IF(J71-K71<0,0,J71-K71)","v":{"v":0,"d":"$0"}}]
["Total(s)",{"$nulls":8},{"$f":"SUM(J69:J71)","v":{"v":0,"d":"$0"}},{"$f":"SUM(K69:K71)","v":{"v":0,"d":"$0"}},{"$f":"SUM(L69:L71)","v":{"v":0,"d":"$0"}}]
["Narrative"]
[]
[]
["G. Subawards (Subgrants)"]
["Description",null,"Purpose",{"$nulls":4},"Consultant?"]
["Provide a description of the activities to be carried out by subrecipients.",null,"Describe the purpose of the subaward (subgrant)",{"$nulls":4},"Is the subaward for a consultant? If yes, use the section below to explain associated travel expenses included in the cost."]
[{"$nulls":9},"Total Cost","Non-Federal Contribution","Federal Request"]
[]
[{"$nulls":11},{"$f":"IF(J81-K81<0,0,J81-K81)","v":{"v":0,"d":"$0"}}]
[{"$nulls":11},{"$f":"IF(J82-K82<0,0,J82-K82)","v":{"v":0,"d":"$0"}}]
[{"$nulls":11},{"$f":"IF(J83-K83<0,0,J83-K83)","v":{"v":0,"d":"$0"}}]
["Total(s)",{"$nulls":8},{"$f":"SUM(J81:J83)+J93","v":{"v":0,"d":"$0"}},{"$f":"SUM(K81:K83)+K93","v":{"v":0,"d":"$0"}},{"$f":"SUM(L81:L83)+L93","v":{"v":0,"d":"$0"}}]
["Consultant Travel (if necessary)"]
["Purpose of Travel","Location",null,"Type of Expense",null,null,"Computation"]
["Indicate the purpose of each trip or type of trip (training, advisory group meeting)","Indicate the travel destination.",null,"Hotel, airfare, per diem",null,null,"Compute the cost of each type of expense X the number of people traveling."]
[{"$nulls":6},"Cost","Duration or Distance","# of Staff","Total Cost","Non-Federal Contribution","Federal Request"]
[]
[{"$nulls":9},{"$f":"CEILING(G90*H90*I90,1)","v":{"v":0,"d":"$0"}},null,{"$f":"IF(J90-K90<0,0,J90-K90)","v":{"v":0,"d":"$0"}}]
[{"$nulls":9},{"$f":"CEILING(G91*H91*I91,1)","v":{"v":0,"d":"$0"}},null,{"$f":"IF(J91-K91<0,0,J91-K91)","v":{"v":0,"d":"$0"}}]
[{"$nulls":9},{"$f":"CEILING(G92*H92*I92,1)","v":{"v":0,"d":"$0"}},null,{"$f":"IF(J92-K92<0,0,J92-K92)","v":{"v":0,"d":"$0"}}]
["Total",{"$nulls":8},{"$f":"SUM(J90:J92)","v":{"v":0,"d":"$0"}},{"$f":"SUM(K90:K92)","v":{"v":0,"d":"$0"}},{"$f":"SUM(L90:L92)","v":{"v":0,"d":"$0"}}]
["Narrative"]
[]
[]
["H. Procurement Contracts"]
["Description",null,"Purpose",{"$nulls":4},"Consultant?"]
["Provide a description of the products or services to be procured by contract and an estimate of the costs.  Applicants are encouraged to promote free and open competition in awarding contracts.  A separate justification must be provided for sole source procurements in excess of the Simplified Acquisition Threshold (currently $150,000). ",null,"Describe the purpose of the contract",{"$nulls":4},"Is the subaward for a consultant? If yes, use the section below to explain associated travel expenses included in the cost."]
[{"$nulls":9},"Total Cost","Non-Federal Contribution","Federal Request"]
[]
[{"$nulls":11},{"$f":"IF(J102-K102<0,0,J102-K102)","v":{"v":0,"d":"$0"}}]
[{"$nulls":11},{"$f":"IF(J103-K103<0,0,J103-K103)","v":{"v":0,"d":"$0"}}]
[{"$nulls":11},{"$f":"IF(J104-K104<0,0,J104-K104)","v":{"v":0,"d":"$0"}}]
["Total(s)",{"$nulls":8},{"$f":"SUM(J102:J104)+J114","v":{"v":0,"d":"$0"}},{"$f":"SUM(K102:K104)+K114","v":{"v":0,"d":"$0"}},{"$f":"SUM(L102:L104)+L114","v":{"v":0,"d":"$0"}}]
["Consultant Travel (if necessary)"]
["Purpose of Travel","Location",null,"Type of Expense",null,null,"Computation"]
["Indicate the purpose of each trip or type of trip (training, advisory group meeting)","Indicate the travel destination.",null,"Hotel, airfare, per diem",null,null,"Compute the cost of each type of expense X the number of people traveling."]
[{"$nulls":6},"Cost","Duration or Distance","# of Staff","Total Cost","Non-Federal Contribution","Federal Request"]
[]
[{"$nulls":9},{"$f":"CEILING(G111*H111*I111,1)","v":{"v":0,"d":"$0"}},null,{"$f":"IF(J111-K111<0,0,J111-K111)","v":{"v":0,"d":"$0"}}]
[{"$nulls":9},{"$f":"CEILING(G112*H112*I112,1)","v":{"v":0,"d":"$0"}},null,{"$f":"IF(J112-K112<0,0,J112-K112)","v":{"v":0,"d":"$0"}}]
[{"$nulls":9},{"$f":"CEILING(G113*H113*I113,1)","v":{"v":0,"d":"$0"}},null,{"$f":"IF(J113-K113<0,0,J113-K113)","v":{"v":0,"d":"$0"}}]
["Total",{"$nulls":8},{"$f":"SUM(J111:J113)","v":{"v":0,"d":"$0"}},{"$f":"SUM(K111:K113)","v":{"v":0,"d":"$0"}},{"$f":"SUM(L111:L113)","v":{"v":0,"d":"$0"}}]
["Narrative"]
[]
[]
["I. Other Costs"]
["Description ",null,"Computation"]
["List and describe items that will be paid with grants funds (e.g. rent, reproduction, telephone, janitorial, or security services, and investigative or confidential funds).",null,"Show the basis for computation"]
[null,null,"Quantity",null,"Basis","Cost",null,"Length of Time",null,"Total Cost","Non-Federal Contribution","Federal Request"]
[]
[{"$nulls":9},{"$f":"CEILING(C123*F123*H123,1)","v":{"v":0,"d":"$0"}},null,{"$f":"IF(J123-K123<0,0,J123-K123)","v":{"v":0,"d":"$0"}}]
[{"$nulls":9},{"$f":"CEILING(C124*F124*H124,1)","v":{"v":0,"d":"$0"}},null,{"$f":"IF(J124-K124<0,0,J124-K124)","v":{"v":0,"d":"$0"}}]
[{"$nulls":9},{"$f":"CEILING(C125*F125*H125,1)","v":{"v":0,"d":"$0"}},null,{"$f":"IF(J125-K125<0,0,J125-K125)","v":{"v":0,"d":"$0"}}]
["Total(s)",{"$nulls":8},{"$f":"SUM(J123:J125)","v":{"v":0,"d":"$0"}},{"$f":"SUM(K123:K125)","v":{"v":0,"d":"$0"}},{"$f":"SUM(L123:L125)","v":{"v":0,"d":"$0"}}]
["Narrative"]
[]
[]
["J. Indirect Costs"]
["Description",null,null,"Computation"]
["Describe what the approved rate is and how it is applied.",null,null,"Compute the indirect costs for those portions of the program which allow such costs."]
[{"$nulls":3},"Base",null,"Indirect Cost Rate",{"$nulls":3},"Total Cost","Non-Federal Contribution","Federal Request"]
[]
[{"$nulls":9},{"$f":"CEILING(D135*F135,1)","v":{"v":0,"d":"$0"}},null,{"$f":"IF(J135-K135<0,0,J135-K135)","v":{"v":0,"d":"$0"}}]
[{"$nulls":9},{"$f":"CEILING(D136*F136,1)","v":{"v":0,"d":"$0"}},null,{"$f":"IF(J136-K136<0,0,J136-K136)","v":{"v":0,"d":"$0"}}]
[{"$nulls":9},{"$f":"CEILING(D137*F137,1)","v":{"v":0,"d":"$0"}},null,{"$f":"IF(J137-K137<0,0,J137-K137)","v":{"v":0,"d":"$0"}}]
["Total(s)",{"$nulls":8},{"$f":"SUM(J135:J137)","v":{"v":0,"d":"$0"}},{"$f":"SUM(K135:K137)","v":{"v":0,"d":"$0"}},{"$f":"SUM(L135:L137)","v":{"v":0,"d":"$0"}}]
["Narrative"]

{"sheet":"Budget Detail - Year 5","index":6,"n_rows":139,"n_cols":12,"rows_kept":139,"merged":[[0,0,0,5],[0,7,0,11],[1,0,1,9],[1,10,2,11],[2,0,2,1],[4,2,4,11],[5,2,5,11],[6,0,7,1],[6,2,7,3],[6,4,7,4],[6,5,7,6],[6,7,7,8],[6,9,7,9],[6,10,7,10],[6,11,7,11],[8,2,8,3],[8,5,8,6],[8,7,8,8],[9,2,9,3],[9,5,9,6],[9,7,9,8],[10,2,10,3],[10,5,10,6],[10,7,10,8],[11,0,11,8],[13,0,14,11],[16,0,16,2],[16,3,16,11],[17,0,17,2],[17,3,17,11],[18,0,19,2],[18,3,19,4],[18,5,19,8],[18,9,19,9],[18,10,19,10],[18,11,19,11],[20,0,20,2],[20,3,20,4],[20,5,20,8],[21,0,21,2],[21,3,21,4],[21,5,21,8],[22,0,22,2],[22,3,22,4],[22,5,22,8],[23,0,23,8],[25,0,26,11],[28,1,28,2],[28,5,28,11],[29,1,29,2],[29,5,29,11],[30,0,31,4],[30,5,31,5],[30,6,31,6],[30,7,31,7],[30,8,31,8],[30,9,31,9],[30,10,31,10],[30,11,31,11],[32,1,32,2],[33,1,33,2],[34,1,34,2],[35,0,35,8],[37,0,38,11],[40,0,40,2],[40,3,40,11],[41,0,41,2],[41,3,41,11],[42,0,43,2],[42,3,43,4],[42,5,43,8],[42,9,43,9],[42,10,43,10],[42,11,43,11],[44,0,44,2],[44,3,44,4],[44,5,44,8],[45,0,45,2],[45,3,45,4],[45,5,45,8],[46,0,46,2],[46,3,46,4],[46,5,46,8],[47,0,47,8],[49,0,50,11],[52,0,52,2],[52,3,52,11],[53,0,53,2],[53,3,53,11],[54,0,55,2],[54,3,55,4],[54,5,55,8],[54,9,55,9],[54,10,55,10],[54,11,55,11],[56,0,56,2],[56,3,56,4],[56,5,56,8],[57,0,57,2],[57,3,57,4],[57,5,57,8],[58,0,58,2],[58,3,58,4],[58,5,58,8],[59,0,59,8],[61,0,62,11],[64,1,64,2],[64,3,64,11],[65,1,65,2],[65,3,65,11],[66,0,67,2],[66,3,67,4],[66,5,67,8],[66,9,67,9],[66,10,67,10],[66,11,67,11],[68,1,68,2],[68,3,68,4],[68,5,68,8],[69,1,69,2],[69,3,69,4],[69,5,69,8],[70,1,70,2],[70,3,70,4],[70,5,70,8],[71,0,71,8],[73,0,74,11],[75,0,75,1],[76,0,76,1],[76,2,76,6],[76,7,76,8],[76,9,77,11],[77,0,77,1],[77,2,77,6],[77,7,77,8],[78,9,79,9],[78,10,79,10],[78,11,79,11],[80,0,80,1],[80,2,80,6],[80,7,80,8],[81,0,81,1],[81,2,81,6],[81,7,81,8],[82,0,82,1],[82,2,82,6],[82,7,82,8],[83,0,83,8],[84,0,84,1],[85,1,85,2],[85,3,85,5],[85,6,85,11],[86,1,86,2],[86,3,86,5],[86,6,86,11],[87,0,88,5],[87,6,88,6],[87,7,88,7],[87,8,88,8],[87,9,88,9],[87,10,88,10],[87,11,88,11],[89,1,89,2],[89,3,89,5],[90,1,90,2],[90,3,90,5],[91,1,91,2],[91,3,91,5],[92,0,92,8],[94,0,95,11],[96,0,96,1],[97,0,97,1],[97,2,97,6],[97,7,97,8],[98,0,98,1],[98,2,98,6],[98,7,98,8],[99,0,100,1],[99,9,100,9],[99,10,100,10],[99,11,100,11],[101,0,101,1],[101,2,101,6],[101,7,101,8],[102,0,102,1],[102,2,102,6],[102,7,102,8],[103,0,103,1],[103,2,103,6],[103,7,103,8],[104,0,104,8],[105,0,105,1],[106,1,106,2],[106,3,106,5],[106,6,106,11],[107,1,107,2],[107,3,107,5],[107,6,107,11],[108,0,109,5],[108,6,109,6],[108,7,109,7],[108,8,109,8],[108,9,109,9],[108,10,109,10],[108,11,109,11],[110,1,110,2],[110,3,110,5],[111,1,111,2],[111,3,111,5],[112,1,112,2],[112,3,112,5],[113,0,113,8],[115,0,116,11],[118,0,118,1],[118,2,118,11],[119,0,119,1],[119,2,119,11],[120,2,121,3],[120,4,121,4],[120,5,121,6],[120,7,121,8],[120,9,121,9],[120,10,121,10],[120,11,121,11],[122,0,122,1],[122,2,122,3],[122,5,122,6],[122,7,122,8],[123,0,123,1],[123,2,123,3],[123,5,123,6],[123,7,123,8],[124,0,124,1],[124,2,124,3],[124,5,124,6],[124,7,124,8],[125,0,125,8],[127,0,128,11],[130,0,130,2],[130,3,130,11],[131,0,131,2],[131,3,131,11],[132,0,133,2],[132,3,133,4],[132,5,133,8],[132,9,133,9],[132,10,133,10],[132,11,133,11],[134,0,134,2],[134,3,134,4],[134,5,134,8],[135,0,135,2],[135,3,135,4],[135,5,135,8],[136,0,136,2],[136,3,136,4],[136,5,136,8],[137,0,137,8],[139,0,140,11]]}
[{"$f":"'Budget Sheet Instructions'!A21","v":"Budget Detail - Year 5"}]
["Does this budget contain conference costs which is defined broadly to include meetings, retreats, seminars, symposia, and training activities? - Y/N"]
["(DOJ Financial Guide, Section 3.10)"]
["A. Personnel"]
["Name","Position","Computation"]
["List each name, if known.","List each position, if known.","Show annual salary rate & amount of time devoted to the project for each name/position."]
[null,null,"Salary ",null,"Rate","Time Worked\n(# of hours, days, months, years)",null,"Percentage of Time",null,"Total Cost","Non-Federal Contribution","Federal Request"]
[]
[{"$nulls":9},{"$f":"CEILING(C9*F9*H9,1)","v":{"v":0,"d":"$0"}},null,{"$f":"IF(J9-K9<0,0,J9-K9)","v":{"v":0,"d":"$0"}}]
[{"$nulls":9},{"$f":"CEILING(C10*F10*H10,1)","v":{"v":0,"d":"$0"}},null,{"$f":"IF(J10-K10<0,0,J10-K10)","v":{"v":0,"d":"$0"}}]
[{"$nulls":9},{"$f":"CEILING(C11*F11*H11,1)","v":{"v":0,"d":"$0"}},null,{"$f":"IF(J11-K11<0,0,J11-K11)","v":{"v":0,"d":"$0"}}]
["Total(s)",{"$nulls":8},{"$f":"SUM(J9:J11)","v":{"v":0,"d":"$0"}},{"$f":"SUM(K9:K11)","v":{"v":0,"d":"$0"}},{"$f":"SUM(L9:L11)","v":{"v":0,"d":"$0"}}]
["Narrative"]
[]
[]
["B. Fringe Benefits"]
["Name",null,null,"Computation"]
["List each grant-supported position receiving fringe benefits.",null,null,"Show the basis for computation."]
[{"$nulls":3},"Base",null,"Rate",{"$nulls":3},"Total Cost","Non-Federal Contribution","Federal Request"]
[]
[{"$nulls":9},{"$f":"CEILING(D21*F21,1)","v":{"v":0,"d":"$0"}},null,{"$f":"IF(J21-K21<0,0,J21-K21)","v":{"v":0,"d":"$0"}}]
[{"$nulls":9},{"$f":"CEILING(D22*F22,1)","v":{"v":0,"d":"$0"}},null,{"$f":"IF(J22-K22<0,0,J22-K22)","v":{"v":0,"d":"$0"}}]
[{"$nulls":9},{"$f":"CEILING(D23*F23,1)","v":{"v":0,"d":"$0"}},null,{"$f":"IF(J23-K23<0,0,J23-K23)","v":{"v":0,"d":"$0"}}]
["Total(s)",{"$nulls":8},{"$f":"SUM(J21:J23)","v":{"v":0,"d":"$0"}},{"$f":"SUM(K21:K23)","v":{"v":0,"d":"$0"}},{"$f":"SUM(L21:L23)","v":{"v":0,"d":"$0"}}]
["Narrative"]
[]
[]
["C. Travel"]
["Purpose of Travel","Location",null,"Type of Expense","Basis","Computation"]
["Indicate the purpose of each trip or type of trip (training, advisory group meeting)","Indicate the travel destination.",null,"Lodging, Meals, Etc.","Per day, mile, trip, Etc.","Compute the cost of each type of expense X the number of people traveling."]
[{"$nulls":5},"Cost","Quantity","# of Staff","# of Trips","Total Cost","Non-Federal Contribution","Federal Request"]
[]
[{"$nulls":4},{"$f":"IF((D33=\"Lodging\"),\"Night\",IF((D33=\"Meals\"),\"Day\",IF((D33=\"Mileage\"),\"Mile\",IF((D33=\"Transportation\"),\"Round-trip\",\"N/A\"))))","v":"N/A"},{"$nulls":4},{"$f":"CEILING(F33*G33*H33*I33,1)","v":{"v":0,"d":"$0"}},null,{"$f":"IF(J33-K33<0,0,J33-K33)","v":{"v":0,"d":"$0"}}]
[{"$nulls":4},{"$f":"IF((D34=\"Lodging\"),\"Night\",IF((D34=\"Meals\"),\"Day\",IF((D34=\"Mileage\"),\"Mile\",IF((D34=\"Transportation\"),\"Round-trip\",\"N/A\"))))","v":"N/A"},{"$nulls":4},{"$f":"CEILING(F34*G34*H34*I34,1)","v":{"v":0,"d":"$0"}},null,{"$f":"IF(J34-K34<0,0,J34-K34)","v":{"v":0,"d":"$0"}}]
[{"$nulls":4},{"$f":"IF((D35=\"Lodging\"),\"Night\",IF((D35=\"Meals\"),\"Day\",IF((D35=\"Mileage\"),\"Mile\",IF((D35=\"Transportation\"),\"Round-trip\",\"N/A\"))))","v":"N/A"},{"$nulls":4},{"$f":"CEILING(F35*G35*H35*I35,1)","v":{"v":0,"d":"$0"}},null,{"$f":"IF(J35-K35<0,0,J35-K35)","v":{"v":0,"d":"$0"}}]
["Total(s)",{"$nulls":8},{"$f":"SUM(J33:J35)","v":{"v":0,"d":"$0"}},{"$f":"SUM(K33:K35)","v":{"v":0,"d":"$0"}},{"$f":"SUM(L33:L35)","v":{"v":0,"d":"$0"}}]
["Narrative"]
[]
[]
["D. Equipment"]
["Item",null,null,"Computation"]
["List and describe each item of equipment that will be purchased",null,null,"Compute the cost (e.g., the number of each item to be purchased X the cost per item)"]
[{"$nulls":3},"# of Items",null,"Unit Cost",{"$nulls":3},"Total Cost","Non-Federal Contribution","Federal Request"]
[]
[{"$nulls":9},{"$f":"CEILING(D45*F45,1)","v":{"v":0,"d":"$0"}},null,{"$f":"IF(J45-K45<0,0,J45-K45)","v":{"v":0,"d":"$0"}}]
[{"$nulls":9},{"$f":"CEILING(D46*F46,1)","v":{"v":0,"d":"$0"}},null,{"$f":"IF(J46-K46<0,0,J46-K46)","v":{"v":0,"d":"$0"}}]
[{"$nulls":9},{"$f":"CEILING(D47*F47,1)","v":{"v":0,"d":"$0"}},null,{"$f":"IF(J47-K47<0,0,J47-K47)","v":{"v":0,"d":"$0"}}]
["Total(s)",{"$nulls":8},{"$f":"SUM(J45:J47)","v":{"v":0,"d":"$0"}},{"$f":"SUM(K45:K47)","v":{"v":0,"d":"$0"}},{"$f":"SUM(L45:L47)","v":{"v":0,"d":"$0"}}]
["Narrative"]
[]
[]
["E. Supplies"]
["Supply Items",null,null,"Computation"]
["Provide a list of the types of items to be purchased with grant funds.",null,null,"Describe the item and the compute the costs. Computation: The number of each item to be purchased X the cost per item."]
[{"$nulls":3},"# of Items",null,"Unit Cost",{"$nulls":3},"Total Cost","Non-Federal Contribution","Federal Request"]
[]
[{"$nulls":9},{"$f":"CEILING(D57*F57,1)","v":{"v":0,"d":"$0"}},null,{"$f":"IF(J57-K57<0,0,J57-K57)","v":{"v":0,"d":"$0"}}]
[{"$nulls":9},{"$f":"CEILING(D58*F58,1)","v":{"v":0,"d":"$0"}},null,{"$f":"IF(J58-K58<0,0,J58-K58)","v":{"v":0,"d":"$0"}}]
[{"$nulls":9},{"$f":"CEILING(D59*F59,1)","v":{"v":0,"d":"$0"}},null,{"$f":"IF(J59-K59<0,0,J59-K59)","v":{"v":0,"d":"$0"}}]
["Total(s)",{"$nulls":8},{"$f":"SUM(J57:J59)","v":{"v":0,"d":"$0"}},{"$f":"SUM(K57:K59)","v":{"v":0,"d":"$0"}},{"$f":"SUM(L57:L59)","v":{"v":0,"d":"$0"}}]
["Narrative"]
[]
[]
["F. Construction"]
["Purpose","Description of Work",null,"Computation"]
["Provide the purpose of the construction","Describe the construction project(s)",null,"Compute the costs (e.g., the number of each item to be purchased X the cost per item)"]
[{"$nulls":3},"# of Items",null,"Cost",{"$nulls":3},"Total Cost","Non-Federal Contribution","Federal Request"]
[]
[{"$nulls":9},{"$f":"CEILING(D69*F69,1)","v":{"v":0,"d":"$0"}},null,{"$f":"IF(J69-K69<0,0,J69-K69)","v":{"v":0,"d":"$0"}}]
[{"$nulls":9},{"$f":"CEILING(D70*F70,1)","v":{"v":0,"d":"$0"}},null,{"$f":"IF(J70-K70<0,0,J70-K70)","v":{"v":0,"d":"$0"}}]
[{"$nulls":9},{"$f":"CEILING(D71*F71,1)","v":{"v":0,"d":"$0"}},null,{"$f":"IF(J71-K71<0,0,J71-K71)","v":{"v":0,"d":"$0"}}]
["Total(s)",{"$nulls":8},{"$f":"SUM(J69:J71)","v":{"v":0,"d":"$0"}},{"$f":"SUM(K69:K71)","v":{"v":0,"d":"$0"}},{"$f":"SUM(L69:L71)","v":{"v":0,"d":"$0"}}]
["Narrative"]
[]
[]
["G. Subawards (Subgrants)"]
["Description",null,"Purpose",{"$nulls":4},"Consultant?"]
["Provide a description of the activities to be carried out by subrecipients.",null,"Describe the purpose of the subaward (subgrant)",{"$nulls":4},"Is the subaward for a consultant? If yes, use the section below to explain associated travel expenses included in the cost."]
[{"$nulls":9},"Total Cost","Non-Federal Contribution","Federal Request"]
[]
[{"$nulls":11},{"$f":"IF(J81-K81<0,0,J81-K81)","v":{"v":0,"d":"$0"}}]
[{"$nulls":11},{"$f":"IF(J82-K82<0,0,J82-K82)","v":{"v":0,"d":"$0"}}]
[{"$nulls":11},{"$f":"IF(J83-K83<0,0,J83-K83)","v":{"v":0,"d":"$0"}}]
["Total(s)",{"$nulls":8},{"$f":"SUM(J81:J83)+J93","v":{"v":0,"d":"$0"}},{"$f":"SUM(K81:K83)+K93","v":{"v":0,"d":"$0"}},{"$f":"SUM(L81:L83)+L93","v":{"v":0,"d":"$0"}}]
["Consultant Travel (if necessary)"]
["Purpose of Travel","Location",null,"Type of Expense",null,null,"Computation"]
["Indicate the purpose of each trip or type of trip (training, advisory group meeting)","Indicate the travel destination.",null,"Hotel, airfare, per diem",null,null,"Compute the cost of each type of expense X the number of people traveling."]
[{"$nulls":6},"Cost","Duration or Distance","# of Staff","Total Cost","Non-Federal Contribution","Federal Request"]
[]
[{"$nulls":9},{"$f":"CEILING(G90*H90*I90,1)","v":{"v":0,"d":"$0"}},null,{"$f":"IF(J90-K90<0,0,J90-K90)","v":{"v":0,"d":"$0"}}]
[{"$nulls":9},{"$f":"CEILING(G91*H91*I91,1)","v":{"v":0,"d":"$0"}},null,{"$f":"IF(J91-K91<0,0,J91-K91)","v":{"v":0,"d":"$0"}}]
[{"$nulls":9},{"$f":"CEILING(G92*H92*I92,1)","v":{"v":0,"d":"$0"}},null,{"$f":"IF(J92-K92<0,0,J92-K92)","v":{"v":0,"d":"$0"}}]
["Total",{"$nulls":8},{"$f":"SUM(J90:J92)","v":{"v":0,"d":"$0"}},{"$f":"SUM(K90:K92)","v":{"v":0,"d":"$0"}},{"$f":"SUM(L90:L92)","v":{"v":0,"d":"$0"}}]
["Narrative"]
[]
[]
["H. Procurement Contracts"]
["Description",null,"Purpose",{"$nulls":4},"Consultant?"]
["Provide a description of the products or services to be procured by contract and an estimate of the costs.  Applicants are encouraged to promote free and open competition in awarding contracts.  A separate justification must be provided for sole source procurements in excess of the Simplified Acquisition Threshold (currently $150,000). ",null,"Describe the purpose of the contract",{"$nulls":4},"Is the subaward for a consultant? If yes, use the section below to explain associated travel expenses included in the cost."]
[{"$nulls":9},"Total Cost","Non-Federal Contribution","Federal Request"]
[]
[{"$nulls":11},{"$f":"IF(J102-K102<0,0,J102-K102)","v":{"v":0,"d":"$0"}}]
[{"$nulls":11},{"$f":"IF(J103-K103<0,0,J103-K103)","v":{"v":0,"d":"$0"}}]
[{"$nulls":11},{"$f":"IF(J104-K104<0,0,J104-K104)","v":{"v":0,"d":"$0"}}]
["Total(s)",{"$nulls":8},{"$f":"SUM(J102:J104)+J114","v":{"v":0,"d":"$0"}},{"$f":"SUM(K102:K104)+K114","v":{"v":0,"d":"$0"}},{"$f":"SUM(L102:L104)+L114","v":{"v":0,"d":"$0"}}]
["Consultant Travel (if necessary)"]
["Purpose of Travel","Location",null,"Type of Expense",null,null,"Computation"]
["Indicate the purpose of each trip or type of trip (training, advisory group meeting)","Indicate the travel destination.",null,"Hotel, airfare, per diem",null,null,"Compute the cost of each type of expense X the number of people traveling."]
[{"$nulls":6},"Cost","Duration or Distance","# of Staff","Total Cost","Non-Federal Contribution","Federal Request"]
[]
[{"$nulls":9},{"$f":"CEILING(G111*H111*I111,1)","v":{"v":0,"d":"$0"}},null,{"$f":"IF(J111-K111<0,0,J111-K111)","v":{"v":0,"d":"$0"}}]
[{"$nulls":9},{"$f":"CEILING(G112*H112*I112,1)","v":{"v":0,"d":"$0"}},null,{"$f":"IF(J112-K112<0,0,J112-K112)","v":{"v":0,"d":"$0"}}]
[{"$nulls":9},{"$f":"CEILING(G113*H113*I113,1)","v":{"v":0,"d":"$0"}},null,{"$f":"IF(J113-K113<0,0,J113-K113)","v":{"v":0,"d":"$0"}}]
["Total",{"$nulls":8},{"$f":"SUM(J111:J113)","v":{"v":0,"d":"$0"}},{"$f":"SUM(K111:K113)","v":{"v":0,"d":"$0"}},{"$f":"SUM(L111:L113)","v":{"v":0,"d":"$0"}}]
["Narrative"]
[]
[]
["I. Other Costs"]
["Description ",null,"Computation"]
["List and describe items that will be paid with grants funds (e.g. rent, reproduction, telephone, janitorial, or security services, and investigative or confidential funds).",null,"Show the basis for computation"]
[null,null,"Quantity",null,"Basis","Cost",null,"Length of Time",null,"Total Cost","Non-Federal Contribution","Federal Request"]
[]
[{"$nulls":9},{"$f":"CEILING(C123*F123*H123,1)","v":{"v":0,"d":"$0"}},null,{"$f":"IF(J123-K123<0,0,J123-K123)","v":{"v":0,"d":"$0"}}]
[{"$nulls":9},{"$f":"CEILING(C124*F124*H124,1)","v":{"v":0,"d":"$0"}},null,{"$f":"IF(J124-K124<0,0,J124-K124)","v":{"v":0,"d":"$0"}}]
[{"$nulls":9},{"$f":"CEILING(C125*F125*H125,1)","v":{"v":0,"d":"$0"}},null,{"$f":"IF(J125-K125<0,0,J125-K125)","v":{"v":0,"d":"$0"}}]
["Total(s)",{"$nulls":8},{"$f":"SUM(J123:J125)","v":{"v":0,"d":"$0"}},{"$f":"SUM(K123:K125)","v":{"v":0,"d":"$0"}},{"$f":"SUM(L123:L125)","v":{"v":0,"d":"$0"}}]
["Narrative"]
[]
[]
["J. Indirect Costs"]
["Description",null,null,"Computation"]
["Describe what the approved rate is and how it is applied.",null,null,"Compute the indirect costs for those portions of the program which allow such costs."]
[{"$nulls":3},"Base",null,"Indirect Cost Rate",{"$nulls":3},"Total Cost","Non-Federal Contribution","Federal Request"]
[]
[{"$nulls":9},{"$f":"CEILING(D135*F135,1)","v":{"v":0,"d":"$0"}},null,{"$f":"IF(J135-K135<0,0,J135-K135)","v":{"v":0,"d":"$0"}}]
[{"$nulls":9},{"$f":"CEILING(D136*F136,1)","v":{"v":0,"d":"$0"}},null,{"$f":"IF(J136-K136<0,0,J136-K136)","v":{"v":0,"d":"$0"}}]
[{"$nulls":9},{"$f":"CEILING(D137*F137,1)","v":{"v":0,"d":"$0"}},null,{"$f":"IF(J137-K137<0,0,J137-K137)","v":{"v":0,"d":"$0"}}]
["Total(s)",{"$nulls":8},{"$f":"SUM(J135:J137)","v":{"v":0,"d":"$0"}},{"$f":"SUM(K135:K137)","v":{"v":0,"d":"$0"}},{"$f":"SUM(L135:L137)","v":{"v":0,"d":"$0"}}]
["Narrative"]

{"sheet":"Budget Summary","index":7,"n_rows":22,"n_cols":12,"rows_kept":22,"merged":[[0,0,0,11],[1,0,1,11],[2,1,2,2],[2,3,2,4],[2,5,2,6],[2,7,2,8],[2,9,2,10],[3,0,6,0],[3,1,6,1],[3,2,6,2],[3,3,6,3],[3,4,6,4],[3,5,6,5],[3,6,6,6],[3,7,6,7],[3,8,6,8],[3,9,6,9],[3,10,6,10],[3,11,6,11],[21,0,21,8],[21,9,21,11]]}
["Budget Summary"]
["Note: Any errors detected on this page should be fixed on the corresponding Budget Detail tab."]
[null,"Year 1",null,"Year 2\n(if needed)",null,"Year 3\n(if needed)",null,"Year 4\n(if needed)",null,"Year 5\n(if needed)"]
["Budget Category","Federal Request","Non-Federal Request","Federal Request","Non-Federal Request","Federal Request","Non-Federal Request","Federal Request","Non-Federal Request","Federal Request","Non-Federal Request","Total(s)"]
[]
[]
[]
["A. Personnel",{"$f":"'Budget Detail - Year 1'!L12","v":{"v":0,"d":"$0"}},{"$f":"'Budget Detail - Year 1'!K12","v":{"v":0,"d":"$0"}},{"$f":"'Budget Detail - Year 2'!L12","v":{"v":0,"d":"$0"}},{"$f":"'Budget Detail - Year 2'!K12","v":{"v":0,"d":"$0"}},{"$f":"'Budget Detail - Year 3'!L12","v":{"v":0,"d":"$0"}},{"$f":"'Budget Detail - Year 3'!K12","v":{"v":0,"d":"$0"}},{"$f":"'Budget Detail - Year 4'!L12","v":{"v":0,"d":"$0"}},{"$f":"'Budget Detail - Year 4'!K12","v":{"v":0,"d":"$0"}},{"$f":"'Budget Detail - Year 5'!L12","v":{"v":0,"d":"$0"}},{"$f":"'Budget Detail - Year 5'!K12","v":{"v":0,"d":"$0"}},{"$f":"SUM(B8:K8)","v":{"v":0,"d":"$0"}}]
["B. Fringe Benefits",{"$f":"'Budget Detail - Year 1'!L24","v":{"v":0,"d":"$0"}},{"$f":"'Budget Detail - Year 1'!K24","v":{"v":0,"d":"$0"}},{"$f":"'Budget Detail - Year 2'!L24","v":{"v":0,"d":"$0"}},{"$f":"'Budget Detail - Year 2'!K24","v":{"v":0,"d":"$0"}},{"$f":"'Budget Detail - Year 3'!L24","v":{"v":0,"d":"$0"}},{"$f":"'Budget Detail - Year 3'!K24","v":{"v":0,"d":"$0"}},{"$f":"'Budget Detail - Year 4'!L24","v":{"v":0,"d":"$0"}},{"$f":"'Budget Detail - Year 4'!K24","v":{"v":0,"d":"$0"}},{"$f":"'Budget Detail - Year 5'!L24","v":{"v":0,"d":"$0"}},{"$f":"'Budget Detail - Year 5'!K24","v":{"v":0,"d":"$0"}},{"v":0,"d":"$0"}]
["C. Travel",{"$f":"'Budget Detail - Year 1'!L36","v":{"v":0,"d":"$0"}},{"$f":"'Budget Detail - Year 1'!K36","v":{"v":0,"d":"$0"}},{"$f":"'Budget Detail - Year 2'!L36","v":{"v":0,"d":"$0"}},{"$f":"'Budget Detail - Year 2'!K36","v":{"v":0,"d":"$0"}},{"$f":"'Budget Detail - Year 3'!L36","v":{"v":0,"d":"$0"}},{"$f":"'Budget Detail - Year 3'!K36","v":{"v":0,"d":"$0"}},{"$f":"'Budget Detail - Year 4'!L36","v":{"v":0,"d":"$0"}},{"$f":"'Budget Detail - Year 4'!K36","v":{"v":0,"d":"$0"}},{"$f":"'Budget Detail - Year 5'!L36","v":{"v":0,"d":"$0"}},{"$f":"'Budget Detail - Year 5'!K36","v":{"v":0,"d":"$0"}},{"v":0,"d":"$0"}]
["D. Equipment",{"$f":"'Budget Detail - Year 1'!L48","v":{"v":0,"d":"$0"}},{"$f":"'Budget Detail - Year 1'!K48","v":{"v":0,"d":"$0"}},{"$f":"'Budget Detail - Year 2'!L48","v":{"v":0,"d":"$0"}},{"$f":"'Budget Detail - Year 2'!K48","v":{"v":0,"d":"$0"}},{"$f":"'Budget Detail - Year 3'!L48","v":{"v":0,"d":"$0"}},{"$f":"'Budget Detail - Year 3'!K48","v":{"v":0,"d":"$0"}},{"$f":"'Budget Detail - Year 4'!L48","v":{"v":0,"d":"$0"}},{"$f":"'Budget Detail - Year 4'!K48","v":{"v":0,"d":"$0"}},{"$f":"'Budget Detail - Year 5'!L48","v":{"v":0,"d":"$0"}},{"$f":"'Budget Detail - Year 5'!K48","v":{"v":0,"d":"$0"}},{"v":0,"d":"$0"}]
["E. Supplies",{"$f":"'Budget Detail - Year 1'!L60","v":{"v":0,"d":"$0"}},{"$f":"'Budget Detail - Year 1'!K60","v":{"v":0,"d":"$0"}},{"$f":"'Budget Detail - Year 2'!L60","v":{"v":0,"d":"$0"}},{"$f":"'Budget Detail - Year 2'!K60","v":{"v":0,"d":"$0"}},{"$f":"'Budget Detail - Year 3'!L60","v":{"v":0,"d":"$0"}},{"$f":"'Budget Detail - Year 3'!K60","v":{"v":0,"d":"$0"}},{"$f":"'Budget Detail - Year 4'!L60","v":{"v":0,"d":"$0"}},{"$f":"'Budget Detail - Year 4'!K60","v":{"v":0,"d":"$0"}},{"$f":"'Budget Detail - Year 5'!L60","v":{"v":0,"d":"$0"}},{"$f":"'Budget Detail - Year 5'!K60","v":{"v":0,"d":"$0"}},{"v":0,"d":"$0"}]
["F. Construction",{"$f":"'Budget Detail - Year 1'!L72","v":{"v":0,"d":"$0"}},{"$f":"'Budget Detail - Year 1'!K72","v":{"v":0,"d":"$0"}},{"$f":"'Budget Detail - Year 2'!L72","v":{"v":0,"d":"$0"}},{"$f":"'Budget Detail - Year 2'!K72","v":{"v":0,"d":"$0"}},{"$f":"'Budget Detail - Year 3'!L72","v":{"v":0,"d":"$0"}},{"$f":"'Budget Detail - Year 3'!K72","v":{"v":0,"d":"$0"}},{"$f":"'Budget Detail - Year 4'!L72","v":{"v":0,"d":"$0"}},{"$f":"'Budget Detail - Year 4'!K72","v":{"v":0,"d":"$0"}},{"$f":"'Budget Detail - Year 5'!L72","v":{"v":0,"d":"$0"}},{"$f":"'Budget Detail - Year 5'!K72","v":{"v":0,"d":"$0"}},{"v":0,"d":"$0"}]
["G. Subawards (Subgrants)",{"$f":"'Budget Detail - Year 1'!L84","v":{"v":0,"d":"$0"}},{"$f":"'Budget Detail - Year 1'!K84","v":{"v":0,"d":"$0"}},{"$f":"'Budget Detail - Year 2'!L84","v":{"v":0,"d":"$0"}},{"$f":"'Budget Detail - Year 2'!K84","v":{"v":0,"d":"$0"}},{"$f":"'Budget Detail - Year 3'!L84","v":{"v":0,"d":"$0"}},{"$f":"'Budget Detail - Year 3'!K84","v":{"v":0,"d":"$0"}},{"$f":"'Budget Detail - Year 4'!L84","v":{"v":0,"d":"$0"}},{"$f":"'Budget Detail - Year 4'!K84","v":{"v":0,"d":"$0"}},{"$f":"'Budget Detail - Year 5'!L84","v":{"v":0,"d":"$0"}},{"$f":"'Budget Detail - Year 5'!K84","v":{"v":0,"d":"$0"}},{"v":0,"d":"$0"}]
["H. Procurement Contracts",{"$f":"'Budget Detail - Year 1'!L105","v":{"v":0,"d":"$0"}},{"$f":"'Budget Detail - Year 1'!K105","v":{"v":0,"d":"$0"}},{"$f":"'Budget Detail - Year 2'!L105","v":{"v":0,"d":"$0"}},{"$f":"'Budget Detail - Year 2'!K105","v":{"v":0,"d":"$0"}},{"$f":"'Budget Detail - Year 3'!L105","v":{"v":0,"d":"$0"}},{"$f":"'Budget Detail - Year 3'!K105","v":{"v":0,"d":"$0"}},{"$f":"'Budget Detail - Year 4'!L105","v":{"v":0,"d":"$0"}},{"$f":"'Budget Detail - Year 4'!K105","v":{"v":0,"d":"$0"}},{"$f":"'Budget Detail - Year 5'!L105","v":{"v":0,"d":"$0"}},{"$f":"'Budget Detail - Year 5'!K105","v":{"v":0,"d":"$0"}},{"v":0,"d":"$0"}]
["I. Other",{"$f":"'Budget Detail - Year 1'!L126","v":{"v":0,"d":"$0"}},{"$f":"'Budget Detail - Year 1'!K126","v":{"v":0,"d":"$0"}},{"$f":"'Budget Detail - Year 2'!L126","v":{"v":0,"d":"$0"}},{"$f":"'Budget Detail - Year 2'!K126","v":{"v":0,"d":"$0"}},{"$f":"'Budget Detail - Year 3'!L126","v":{"v":0,"d":"$0"}},{"$f":"'Budget Detail - Year 3'!K126","v":{"v":0,"d":"$0"}},{"$f":"'Budget Detail - Year 4'!L126","v":{"v":0,"d":"$0"}},{"$f":"'Budget Detail - Year 4'!K126","v":{"v":0,"d":"$0"}},{"$f":"'Budget Detail - Year 5'!L126","v":{"v":0,"d":"$0"}},{"$f":"'Budget Detail - Year 5'!K126","v":{"v":0,"d":"$0"}},{"v":0,"d":"$0"}]
[]
["Total Direct Costs",{"$f":"SUM(B8:B16)","v":{"v":0,"d":"$0"}},{"v":0,"d":"$0"},{"v":0,"d":"$0"},{"v":0,"d":"$0"},{"v":0,"d":"$0"},{"v":0,"d":"$0"},{"v":0,"d":"$0"},{"v":0,"d":"$0"},{"v":0,"d":"$0"},{"v":0,"d":"$0"},{"$f":"SUM(B18:K18)","v":{"v":0,"d":"$0"}}]
["J. Indirect Costs",{"$f":"'Budget Detail - Year 1'!L138","v":{"v":0,"d":"$0"}},{"$f":"'Budget Detail - Year 1'!K138","v":{"v":0,"d":"$0"}},{"$f":"'Budget Detail - Year 2'!L138","v":{"v":0,"d":"$0"}},{"$f":"'Budget Detail - Year 2'!K138","v":{"v":0,"d":"$0"}},{"$f":"'Budget Detail - Year 3'!L138","v":{"v":0,"d":"$0"}},{"$f":"'Budget Detail - Year 3'!K138","v":{"v":0,"d":"$0"}},{"$f":"'Budget Detail - Year 4'!L138","v":{"v":0,"d":"$0"}},{"$f":"'Budget Detail - Year 4'!K138","v":{"v":0,"d":"$0"}},{"$f":"'Budget Detail - Year 5'!L138","v":{"v":0,"d":"$0"}},{"$f":"'Budget Detail - Year 5'!K138","v":{"v":0,"d":"$0"}},{"$f":"SUM(B19:K19)","v":{"v":0,"d":"$0"}}]
[]
["Total Project Costs",{"$f":"SUM(B18,B19)","v":{"v":0,"d":"$0"}},{"v":0,"d":"$0"},{"$f":"SUM(D18,D19)","v":{"v":0,"d":"$0"}},{"v":0,"d":"$0"},{"v":0,"d":"$0"},{"v":0,"d":"$0"},{"v":0,"d":"$0"},{"v":0,"d":"$0"},{"v":0,"d":"$0"},{"v":0,"d":"$0"},{"$f":"SUM(B21:K21)","v":{"v":0,"d":"$0"}}]
["Does this budget contain conference costs which is defined broadly to include meetings, retreats, seminars, symposia, and training activities? - Y/N",{"$nulls":8},{"$f":"IF(OR('Budget Detail - Year 1'!K2=\"Yes\",'Budget Detail - Year 2'!K2=\"Yes\",'Budget Detail - Year 3'!K2=\"Yes\",'Budget Detail - Year 4'!K2=\"Yes\",'Budget Detail - Year 5'!K2=\"Yes\"),\"Yes\",\"No\")","v":"No"}]

{"sheet":"Admin","index":8,"n_rows":1,"n_cols":1,"rows_kept":1,"hidden":true}
["devuser1"]

{"sheet":"Reference Data","index":9,"n_rows":38,"n_cols":3,"rows_kept":38,"hidden":true}
[{"$f":"19760","v":19760},{"$f":"A1*0.9","v":17784},{"$f":"A1*0.1","v":1976}]
[]
[]
[]
[]
["PA1 Equipment Dropdown Options"]
["Vehicles"]
["Vehicles w/ accessory package"]
["Radios"]
["Computers"]
["Computer Aided Dispatch"]
["Records Management System"]
["Communication System"]
["Basic Issue Firearm"]
["Basic Issue Equipment"]
["Bullet Proof Vests"]
[]
["PA1 Supplies Dropdown Options"]
["Basic Issue Uniforms"]
[]
["PA1 Personnel Options"]
["Entry Level Sworn Officer"]
["Village Public Safety Officer (AK Only)"]
["Entry Level Sworn Ranger"]
["Entry Level Sworn Conservation and Wildlife Officer"]
["Civilian Methamphetamine Coordinator"]
[]
["Demographics Yes No Options"]
["Yes"]
["No"]
[]
["Travel Items"]
["Lodging"]
["Meals"]
["Mileage"]
["Transportation"]
["Local Travel"]
["Other"]

{"sheet":"Example - Budget Detail Sheet","index":10,"n_rows":163,"n_cols":12,"rows_kept":163,"merged":[[0,0,0,5],[0,7,0,11],[1,0,1,9],[1,10,2,11],[2,0,2,1],[4,2,4,11],[5,2,5,11],[6,0,7,1],[6,2,7,3],[6,4,7,4],[6,5,7,6],[6,7,7,8],[6,9,7,9],[6,10,7,10],[6,11,7,11],[8,2,8,3],[8,5,8,6],[8,7,8,8],[9,2,9,3],[9,5,9,6],[9,7,9,8],[10,2,10,3],[10,5,10,6],[10,7,10,8],[11,2,11,3],[11,5,11,6],[11,7,11,8],[12,2,12,3],[12,5,12,6],[12,7,12,8],[13,2,13,3],[13,5,13,6],[13,7,13,8],[14,0,14,8],[16,0,17,11],[19,0,19,2],[19,3,19,11],[20,0,20,2],[20,3,20,11],[21,0,22,2],[21,3,22,4],[21,5,22,8],[21,9,22,9],[21,10,22,10],[21,11,22,11],[23,0,23,2],[23,3,23,4],[23,5,23,8],[24,0,24,2],[24,3,24,4],[24,5,24,8],[25,0,25,2],[25,3,25,4],[25,5,25,8],[26,0,26,2],[26,3,26,4],[26,5,26,8],[27,0,27,2],[27,3,27,4],[27,5,27,8],[28,0,28,8],[30,0,31,11],[33,1,33,2],[33,5,33,11],[34,1,34,2],[34,5,34,11],[35,0,36,4],[35,5,36,5],[35,6,36,6],[35,7,36,7],[35,8,36,8],[35,9,36,9],[35,10,36,10],[35,11,36,11],[37,1,37,2],[38,1,38,2],[39,1,39,2],[40,1,40,2],[41,1,41,2],[42,1,42,2],[43,1,43,2],[44,1,44,2],[45,1,45,2],[46,1,46,2],[47,1,47,2],[48,1,48,2],[49,1,49,2],[50,1,50,2],[51,1,51,2],[52,0,52,8],[54,0,55,11],[57,0,57,2],[57,3,57,11],[58,0,58,2],[58,3,58,11],[59,0,60,2],[59,3,60,4],[59,5,60,8],[59,9,60,9],[59,10,60,10],[59,11,60,11],[61,0,61,2],[61,3,61,4],[61,5,61,8],[62,0,62,2],[62,3,62,4],[62,5,62,8],[63,0,63,1],[63,3,63,4],[63,5,63,8],[64,0,64,8],[66,0,67,11],[69,0,69,2],[69,3,69,11],[70,0,70,2],[70,3,70,11],[71,0,72,2],[71,3,72,4],[71,5,72,8],[71,9,72,9],[71,10,72,10],[71,11,72,11],[73,0,73,2],[73,3,73,4],[73,5,73,8],[74,0,74,2],[74,3,74,4],[74,5,74,8],[75,0,75,2],[75,3,75,4],[75,5,75,8],[76,0,76,2],[76,3,76,4],[76,5,76,8],[77,0,77,2],[77,3,77,4],[77,5,77,8],[78,0,78,1],[78,3,78,4],[78,5,78,8],[79,0,79,8],[81,0,82,11],[83,1,83,11],[84,1,84,2],[84,3,84,11],[85,1,85,2],[85,3,85,11],[86,0,87,2],[86,3,87,4],[86,5,87,8],[86,9,87,9],[86,10,87,10],[86,11,87,11],[88,1,88,2],[88,3,88,4],[88,5,88,8],[89,0,89,8],[91,0,92,11],[93,0,93,1],[94,0,94,1],[94,2,94,6],[94,7,94,8],[94,9,95,11],[95,0,95,1],[95,2,95,6],[95,7,95,8],[96,9,97,9],[96,10,97,10],[96,11,97,11],[98,0,98,1],[98,2,98,8],[99,0,99,1],[99,2,99,6],[99,7,99,8],[100,0,100,1],[100,2,100,8],[101,0,101,8],[102,0,102,1],[103,1,103,2],[103,3,103,5],[103,6,103,11],[104,1,104,2],[104,3,104,5],[104,6,104,11],[105,0,106,5],[105,6,106,6],[105,7,106,7],[105,8,106,8],[105,9,106,9],[105,10,106,10],[105,11,106,11],[107,1,107,2],[107,3,107,5],[108,1,108,2],[108,3,108,5],[109,1,109,2],[109,3,109,5],[110,0,110,8],[112,0,113,11],[114,0,114,1],[115,0,115,1],[115,2,115,6],[115,7,115,8],[116,0,116,1],[116,2,116,6],[116,7,116,8],[117,9,118,9],[117,10,118,10],[117,11,118,11],[119,0,119,1],[119,2,119,8],[120,0,120,1],[120,2,120,6],[120,7,120,8],[121,0,121,1],[121,2,121,6],[121,7,121,8],[122,0,122,1],[122,2,122,8],[123,0,123,8],[124,0,124,1],[125,1,125,2],[125,3,125,5],[125,6,125,11],[126,1,126,2],[126,3,126,5],[126,6,126,11],[127,0,128,5],[127,6,128,6],[127,7,128,7],[127,8,128,8],[127,9,128,9],[127,10,128,10],[127,11,128,11],[129,1,129,2],[129,3,129,5],[130,1,130,2],[130,3,130,5],[131,1,131,2],[131,3,131,5],[132,0,132,8],[134,0,135,11],[136,0,136,11],[138,0,138,1],[138,2,138,11],[139,0,139,1],[139,2,139,11],[140,2,141,3],[140,4,141,4],[140,5,141,6],[140,7,141,8],[140,9,141,9],[140,10,141,10],[140,11,141,11],[142,0,142,1],[142,2,142,3],[142,5,142,6],[142,7,142,8],[143,0,143,1],[143,2,143,3],[143,5,143,6],[143,7,143,8],[144,0,144,1],[144,2,144,3],[144,5,144,6],[144,7,144,8],[145,0,145,1],[145,2,145,3],[145,5,145,6],[145,7,145,8],[146,0,146,1],[146,2,146,3],[146,5,146,6],[146,7,146,8],[147,0,147,1],[147,2,147,3],[147,5,147,6],[147,7,147,8],[148,0,148,8],[150,0,151,11],[153,0,153,2],[153,3,153,11],[154,0,154,2],[154,3,154,11],[155,0,156,2],[155,3,156,4],[155,5,156,8],[155,9,156,9],[155,10,156,10],[155,11,156,11],[157,0,157,2],[157,3,157,4],[157,5,157,8],[158,0,158,2],[158,3,158,4],[158,5,158,8],[159,0,159,2],[159,3,159,4],[159,5,159,8],[160,0,160,8],[162,0,163,11]]}
["Budget Detail\nEXAMPLE"]
["Does this budget contain conference costs which is defined broadly to include meetings, retreats, seminars, symposia, and training activities? - Y/N"]
["(DOJ Financial Guide, Section 3.10)"]
["A. Personnel"]
["Name","Position","Computation"]
["List each name, if known.","List each position, if known.","Show annual salary rate & amount of time devoted to the project for each name/position."]
[null,null,"Salary ",null,"Rate","Time Worked\n(# of hours, days, months, years)",null,"Percentage of Time",null,"Total Cost","Non-Federal Contribution","Federal Request"]
[]
[{"$nulls":9},{"$f":"CEILING(C9*F9*H9,1)","v":{"v":0,"d":"$0"}},null,{"$f":"IF(J9-K9<0,0,J9-K9)","v":{"v":0,"d":"$0"}}]
["John Smith","Executive Director",{"v":140000,"d":"$140,000"},null,"yearly",1,null,{"v":0.05,"d":"5%"},null,{"v":7000,"d":"$7,000"},{"v":0,"d":"$0"},{"v":7000,"d":"$7,000"}]
["Jane Doe","Project Manager",{"v":90000,"d":"$90,000"},null,"yearly",1,null,{"v":0.75,"d":"75%"},null,{"v":67500,"d":"$67,500"},{"v":0,"d":"$0"},{"v":67500,"d":"$67,500"}]
["Alex Jones","Program Assistant",{"v":22,"d":"$22"},null,"hourly",{"v":1040,"d":"1,040"},null,{"v":1,"d":"100%"},null,{"v":22880,"d":"$22,880"},{"v":0,"d":"$0"},{"v":22880,"d":"$22,880"}]
[{"$nulls":9},{"v":0,"d":"$0"},null,{"v":0,"d":"$0"}]
[{"$nulls":9},{"v":0,"d":"$0"},null,{"v":0,"d":"$0"}]
["Total(s)",{"$nulls":8},{"$f":"SUM(J9:J14)","v":{"v":97380,"d":"$97,380"}},{"$f":"SUM(K9:K14)","v":{"v":0,"d":"$0"}},{"$f":"SUM(L9:L14)","v":{"v":97380,"d":"$97,380"}}]
["Narrative"]
["John Smith, Executive Director, will provide oversight on the entire award providing 5% of this time to the project.\nJane Doe, Project Manager, will manage the project, complete reports, and submit deliverables spending 75% of her time on the project.\nAlex Jones, Program Assistant, will provide the project manager assistance where needed spending 1,040 hours on the project.\n"]
[]
["B. Fringe Benefits"]
["Name",null,null,"Computation"]
["List each grant-supported position receiving fringe benefits.",null,null,"Show the basis for computation."]
[{"$nulls":3},"Base",null,"Rate",{"$nulls":3},"Total Cost","Non-Federal Contribution","Federal Request"]
[]
[{"$nulls":9},{"$f":"CEILING(D24*F24,1)","v":{"v":0,"d":"$0"}},null,{"$f":"IF(J24-K24<0,0,J24-K24)","v":{"v":0,"d":"$0"}}]
["John Smith",null,null,{"v":7000,"d":"$7,000"},null,{"v":0.25,"d":"25.00%"},{"$nulls":3},{"$f":"CEILING(D25*F25,1)","v":{"v":1750,"d":"$1,750"}},{"v":0,"d":"$0"},{"$f":"IF(J25-K25<0,0,J25-K25)","v":{"v":1750,"d":"$1,750"}}]
["Jane Doe",null,null,{"v":67500,"d":"$67,500"},null,{"v":0.25,"d":"25.00%"},{"$nulls":3},{"$f":"CEILING(D26*F26,1)","v":{"v":16875,"d":"$16,875"}},{"v":0,"d":"$0"},{"$f":"IF(J26-K26<0,0,J26-K26)","v":{"v":16875,"d":"$16,875"}}]
["Alex Jones",null,null,{"v":22880,"d":"$22,880"},null,{"v":0.25,"d":"25.00%"},{"$nulls":3},{"$f":"CEILING(D27*F27,1)","v":{"v":5720,"d":"$5,720"}},{"v":0,"d":"$0"},{"$f":"IF(J27-K27<0,0,J27-K27)","v":{"v":5720,"d":"$5,720"}}]
[{"$nulls":9},{"$f":"CEILING(D28*F28,1)","v":{"v":0,"d":"$0"}},null,{"$f":"IF(J28-K28<0,0,J28-K28)","v":{"v":0,"d":"$0"}}]
["Total(s)",{"$nulls":8},{"$f":"SUM(J24:J28)","v":{"v":24345,"d":"$24,345"}},{"$f":"SUM(K24:K28)","v":{"v":0,"d":"$0"}},{"$f":"SUM(L24:L28)","v":{"v":24345,"d":"$24,345"}}]
["Narrative"]
["Our fringe benefits rate is 25% and covers the following items: FICA (7.65%), Worker's comp (1.35%), Health Insurance (11%), Retirement (5%)"]
[]
["C. Travel"]
["Purpose of Travel","Location",null,"Type of Expense","Basis","Computation"]
["Indicate the purpose of each trip or type of trip (training, advisory group meeting)","Indicate the travel destination.",null,"Lodging, Meals, Etc.","Per day, mile, trip, Etc.","Compute the cost of each type of expense X the number of people traveling."]
[{"$nulls":5},"Cost","Quantity","# of Staff","# of Trips","Total Cost","Non-Federal Contribution","Federal Request"]
[]
[{"$nulls":4},{"$f":"IF((D38=\"Lodging\"),\"Night\",IF((D38=\"Meals\"),\"Day\",IF((D38=\"Mileage\"),\"Mile\",IF((D38=\"Transportation\"),\"Round-trip\",\"N/A\"))))","v":"N/A"},{"$nulls":4},{"$f":"CEILING(F38*G38*H38*I38,1)","v":{"v":0,"d":"$0"}},null,{"$f":"IF(J38-K38<0,0,J38-K38)","v":{"v":0,"d":"$0"}}]
["Project Manager Training","Reno, NV",null,"Other","N/A",{"v":50,"d":"$50.00"},1,1,1,{"v":50,"d":"$50"},{"v":0,"d":"$0"},{"v":50,"d":"$50"}]
["Project Manager Training","Reno, NV",null,"Local Travel","N/A",{"v":50,"d":"$50.00"},1,1,1,{"v":50,"d":"$50"},{"v":0,"d":"$0"},{"v":50,"d":"$50"}]
["Project Manager Training","Reno, NV",null,"Transportation","Round-trip",{"v":600,"d":"$600.00"},1,1,1,{"v":600,"d":"$600"},{"v":0,"d":"$0"},{"v":600,"d":"$600"}]
["Project Manager Training","Reno, NV",null,"Mileage","Mile",{"v":0.51,"d":"$0.51"},100,1,1,{"v":51,"d":"$51"},{"v":0,"d":"$0"},{"v":51,"d":"$51"}]
["Project Manager Training","Reno, NV",null,"Meals","Day",{"v":51,"d":"$51.00"},5.5,1,1,{"v":281,"d":"$281"},{"v":0,"d":"$0"},{"v":281,"d":"$281"}]
["Project Manager Training","Reno, NV",null,"Lodging","Night",{"v":94,"d":"$94.00"},5,1,1,{"v":470,"d":"$470"},{"v":0,"d":"$0"},{"v":470,"d":"$470"}]
["Project Manager Field Travel","Various",null,"Mileage","Mile",{"v":0.51,"d":"$0.51"},250,1,20,{"v":2550,"d":"$2,550"},{"v":0,"d":"$0"},{"v":2550,"d":"$2,550"}]
["Mandatory Orientation Training","Washington, DC",null,"Local Travel","N/A",{"v":25,"d":"$25.00"},1,3,1,{"v":75,"d":"$75"},{"v":0,"d":"$0"},{"v":75,"d":"$75"}]
["Mandatory Orientation Training","Washington, DC",null,"Other","N/A",{"v":50,"d":"$50.00"},1,3,1,{"v":150,"d":"$150"},{"v":0,"d":"$0"},{"v":150,"d":"$150"}]
["Mandatory Orientation Training","Washington, DC",null,"Transportation","Round-trip",{"v":500,"d":"$500.00"},1,3,1,{"v":1500,"d":"$1,500"},{"v":0,"d":"$0"},{"v":1500,"d":"$1,500"}]
["Mandatory Orientation Training","Washington, DC",null,"Mileage","Mile",{"v":0.51,"d":"$0.51"},100,1,1,{"v":51,"d":"$51"},{"v":0,"d":"$0"},{"v":51,"d":"$51"}]
["Mandatory Orientation Training","Washington, DC",null,"Meals","Day",{"v":71,"d":"$71.00"},3.5,3,1,{"v":746,"d":"$746"},{"v":0,"d":"$0"},{"v":746,"d":"$746"}]
["Mandatory Orientation Training","Washington, DC",null,"Lodging","Night",{"v":224,"d":"$224.00"},3,3,1,{"v":2016,"d":"$2,016"},{"v":0,"d":"$0"},{"v":2016,"d":"$2,016"}]
[{"$nulls":4},"N/A",{"$nulls":4},{"v":0,"d":"$0"},null,{"v":0,"d":"$0"}]
["Total(s)",{"$nulls":8},{"$f":"SUM(J38:J52)","v":{"v":8590,"d":"$8,590"}},{"$f":"SUM(K38:K52)","v":{"v":0,"d":"$0"}},{"$f":"SUM(L38:L52)","v":{"v":8590,"d":"$8,590"}}]
["Narrative"]
["Per award guidelines, key memebers must attend orientation training in Washington, DC.  WE are following our own written travel policy.  Lodging is for 3 nights and meals are budgeted at 3.5 days as the two travel days are computed at .75 days.  Mileage to get to the airport and local travel is for taxi to and from the airport.  Also baggage fees of $50 is $25 each way.\n\nThe project manager will attend trainin in REno, NV.  We are following our own written travel policy.  Lodging is for 5 nights and meals are budgeted at 5.5 days as the two travel days are computed at .75 days.  Mileage to get to the airport and local travel is for taxi to and from the airport.  Also, baggage fees of $50 is for $25 each way.\n\nThe project manager will use her own vehicle to travel to complete field work with the average trip around 250 miles and an anticipated 20 trips."]
[]
["D. Equipment"]
["Item",null,null,"Computation"]
["List and describe each item of equipment that will be purchased",null,null,"Compute the cost (e.g., the number of each item to be purchased X the cost per item)"]
[{"$nulls":3},"# of Items",null,"Cost",{"$nulls":3},"Total Cost","Non-Federal Contribution","Federal Request"]
[]
[{"$nulls":9},{"$f":"CEILING(D62*F62,1)","v":{"v":0,"d":"$0"}},null,{"$f":"IF(J62-K62<0,0,J62-K62)","v":{"v":0,"d":"$0"}}]
["Dell Laptop Computer",null,null,1,null,{"v":2547,"d":"$2,547"},{"$nulls":3},{"$f":"CEILING(D63*F63,1)","v":{"v":2547,"d":"$2,547"}},{"v":0,"d":"$0"},{"$f":"IF(J63-K63<0,0,J63-K63)","v":{"v":2547,"d":"$2,547"}}]
[{"$nulls":9},{"$f":"CEILING(D64*F64,1)","v":{"v":0,"d":"$0"}},null,{"$f":"IF(J64-K64<0,0,J64-K64)","v":{"v":0,"d":"$0"}}]
["Total(s)",{"$nulls":8},{"$f":"SUM(J62:J64)","v":{"v":2547,"d":"$2,547"}},{"$f":"SUM(K62:K64)","v":{"v":0,"d":"$0"}},{"$f":"SUM(L62:L64)","v":{"v":2547,"d":"$2,547"}}]
["Narrative"]
["The project manager will need a laptop computer while out in the field and while away at training.  We are following our agency's capitalization policy."]
[]
["E. Supplies"]
["Supply Items",null,null,"Computation"]
["Provide a list of the types of items to be purchased with grant funds.",null,null,"Describe the item and the compute the costs. Computation: The number of each item to be purchased X the cost per item."]
[{"$nulls":3},"# of Items",null,"Cost",{"$nulls":3},"Total Cost","Non-Federal Contribution","Federal Request"]
[]
[{"$nulls":9},{"$f":"CEILING(D74*F74,1)","v":{"v":0,"d":"$0"}},null,{"$f":"IF(J74-K74<0,0,J74-K74)","v":{"v":0,"d":"$0"}}]
["Printer",null,null,1,null,{"v":500,"d":"$500.00"},{"$nulls":3},{"v":500,"d":"$500"},{"v":0,"d":"$0"},{"v":500,"d":"$500"}]
["Locking file cabinet",null,null,2,null,{"v":1000,"d":"$1,000.00"},{"$nulls":3},{"v":2000,"d":"$2,000"},{"v":0,"d":"$0"},{"v":2000,"d":"$2,000"}]
["Flatbed scanner",null,null,1,null,{"v":400,"d":"$400.00"},{"$nulls":3},{"v":400,"d":"$400"},{"v":0,"d":"$0"},{"v":400,"d":"$400"}]
["General office supplies",null,null,12,null,{"v":150,"d":"$150.00"},{"$nulls":3},{"v":1800,"d":"$1,800"},{"v":0,"d":"$0"},{"v":1800,"d":"$1,800"}]
[{"$nulls":9},{"v":0,"d":"$0"},null,{"v":0,"d":"$0"}]
["Total(s)",{"$nulls":8},{"$f":"SUM(J74:J79)","v":{"v":4700,"d":"$4,700"}},{"$f":"SUM(K74:K79)","v":{"v":0,"d":"$0"}},{"$f":"SUM(L74:L79)","v":{"v":4700,"d":"$4,700"}}]
["Narrative"]
["The project manager will need a printer to print reports.  A locking file cabinet is needed to keep client information secure. A flatbed scanner is needed to scan various documents collected in the field.  General office supplies will be used bt all personnel on this project and include: pens, pencils, paper, binder clips, and other basic supplies.  The office supplies are based on 12 months at $150 per month.  This amount was determined based upon other projects of this size that we have completed in the past."]
[]
["F. Construction","As a rule, construction costs are not allowable. Consult with the program office before budgeting funds in this category."]
["Purpose","Description of Work",null,"Computation"]
["Provide the purpose of the construction","Describe the construction project(s)",null,"Compute the costs (e.g., the number of each item to be purchased X the cost per item)"]
[{"$nulls":3},"# of Items",null,"Cost",{"$nulls":3},"Total Cost","Non-Federal Contribution","Federal Request"]
[]
[{"$nulls":9},{"$f":"CEILING(D89*F89,1)","v":{"v":0,"d":"$0"}},null,{"$f":"IF(J89-K89<0,0,J89-K89)","v":{"v":0,"d":"$0"}}]
["Total(s)",{"$nulls":8},{"$f":"SUM(J89:J89)","v":{"v":0,"d":"$0"}},{"$f":"SUM(K89:K89)","v":{"v":0,"d":"$0"}},{"$f":"SUM(L89:L89)","v":{"v":0,"d":"$0"}}]
["Narrative"]
[]
[]
["G. Subawards (Subgrants)"]
["Description",null,"Purpose",{"$nulls":4},"Consultant"]
["Provide a description of the activities to be carried out by subrecipients.",null,"Describe the purpose of the subaward (subgrant)",{"$nulls":4},"Is the subaward for a consultant?"]
[{"$nulls":9},"Total Cost","Non-Federal Contribution","Federal Request"]
[]
[{"$nulls":11},{"$f":"IF(J99-K99<0,0,J99-K99)","v":{"v":0,"d":"$0"}}]
["Conduct field activities in a remote area",null,"Provide services and conduct field work in a remote area included in the project",{"$nulls":4},"No",null,{"v":25000,"d":"$25,000"},{"v":0,"d":"$0"},{"$f":"IF(J100-K100<0,0,J100-K100)","v":{"v":25000,"d":"$25,000"}}]
[{"$nulls":11},{"$f":"IF(J101-K101<0,0,J101-K101)","v":{"v":0,"d":"$0"}}]
["Total(s)",{"$nulls":8},{"$f":"SUM(J99:J101)","v":{"v":25000,"d":"$25,000"}},{"$f":"SUM(K99:K101)","v":{"v":0,"d":"$0"}},{"$f":"SUM(L99:L101)","v":{"v":25000,"d":"$25,000"}}]
["Consultant Travel (if necessary)"]
["Purpose of Travel","Location",null,"Type of Expense",null,null,"Computation"]
["Indicate the purpose of each trip or type of trip (training, advisory group meeting)","Indicate the travel destination.",null,"Hotel, airfare, per diem",null,null,"Compute the cost of each type of expense X the number of people traveling."]
[{"$nulls":6},"Cost","Duration or Distance","# of Staff","Total Cost","Non-Federal Contribution","Federal Request"]
[]
[{"$nulls":9},{"$f":"CEILING(G108*H108*I108,1)","v":{"v":0,"d":"$0"}},null,{"$f":"IF(J108-K108<0,0,J108-K108)","v":{"v":0,"d":"$0"}}]
[{"$nulls":9},{"$f":"CEILING(G109*H109*I109,1)","v":{"v":0,"d":"$0"}},null,{"$f":"IF(J109-K109<0,0,J109-K109)","v":{"v":0,"d":"$0"}}]
[{"$nulls":9},{"$f":"CEILING(G110*H110*I110,1)","v":{"v":0,"d":"$0"}},null,{"$f":"IF(J110-K110<0,0,J110-K110)","v":{"v":0,"d":"$0"}}]
["Total",{"$nulls":8},{"$f":"SUM(J108:J110)","v":{"v":0,"d":"$0"}},{"$f":"SUM(K108:K110)","v":{"v":0,"d":"$0"}},{"$f":"SUM(L108:L110)","v":{"v":0,"d":"$0"}}]
["Narrative"]
["The agency will make a subaward to provide services and conduct field work in a remote area.  The $25,000 was calculated based upon a similar size project completed in the same area."]
[]
["H. Procurement Contracts"]
["Description",null,"Purpose",{"$nulls":4},"Consultant"]
["Provide a description of the products or services to be procured by contract and an estimate of the costs.  Applicants are encouraged to promote free and open competition in awarding contracts.  A separate justification must be provided for sole source procurements in excess of the Simplified Acquisition Threshold (currently $150,000). ",null,"Describe the purpose of the contract",{"$nulls":4},"Is the contract for a consultant?"]
[{"$nulls":9},"Total Cost","Non-Federal Contribution","Federal Request"]
[]
[{"$nulls":11},{"$f":"IF(J120-K120<0,0,J120-K120)","v":{"v":0,"d":"$0"}}]
["William Penn, CPA",null,"Accounting Assistance",{"$nulls":4},"Yes",null,{"v":9400,"d":"$9,400"},{"v":0,"d":"$0"},{"$f":"IF(J121-K121<0,0,J121-K121)","v":{"v":9400,"d":"$9,400"}}]
["ABC Company",null,"Survey creation and data entry services from submitted surveys.",{"$nulls":4},"No",null,{"v":40000,"d":"$40,000"},{"v":0,"d":"$0"},{"$f":"IF(J122-K122<0,0,J122-K122)","v":{"v":40000,"d":"$40,000"}}]
[{"$nulls":11},{"$f":"IF(J123-K123<0,0,J123-K123)","v":{"v":0,"d":"$0"}}]
["Total(s)",{"$nulls":8},{"$f":"SUM(J120:J123)","v":{"v":49400,"d":"$49,400"}},{"$f":"SUM(K120:K123)","v":{"v":0,"d":"$0"}},{"$f":"SUM(L120:L123)","v":{"v":49400,"d":"$49,400"}}]
["Consultant Travel (if necessary)"]
["Purpose of Travel","Location",null,"Type of Expense",null,null,"Computation"]
["Indicate the purpose of each trip or type of trip (training, advisory group meeting)","Indicate the travel destination.",null,"Hotel, airfare, per diem",null,null,"Compute the cost of each type of expense X the number of people traveling."]
[{"$nulls":6},"Cost","Duration or Distance","# of Staff","Total Cost","Non-Federal Contribution","Federal Request"]
[]
[{"$nulls":9},{"$f":"CEILING(G130*H130*I130,1)","v":{"v":0,"d":"$0"}},null,{"$f":"IF(J130-K130<0,0,J130-K130)","v":{"v":0,"d":"$0"}}]
[{"$nulls":9},{"$f":"CEILING(G131*H131*I131,1)","v":{"v":0,"d":"$0"}},null,{"$f":"IF(J131-K131<0,0,J131-K131)","v":{"v":0,"d":"$0"}}]
[{"$nulls":9},{"$f":"CEILING(G132*H132*I132,1)","v":{"v":0,"d":"$0"}},null,{"$f":"IF(J132-K132<0,0,J132-K132)","v":{"v":0,"d":"$0"}}]
["Total",{"$nulls":8},{"$f":"SUM(J130:J132)","v":{"v":0,"d":"$0"}},{"$f":"SUM(K130:K132)","v":{"v":0,"d":"$0"}},{"$f":"SUM(L130:L132)","v":{"v":0,"d":"$0"}}]
["Narrative"]
["ABC Company will put together online an online survey at the direction of the project manager to reach out to the various sites to determine the needs.  In addition a hard copy survey will also be available for thos unable to use the online survey.  ABC Company will key in the hard copy surveys.  Once the surveys are completed, ABC Company will compile the data for the project manager.\n\nWilliam Penn will assist in completing financial reports as well as tracking award expenditures.  Mr. Penn's rate is $47 per hour, and we estimate that Mr. Penn will provide 200 hours of services."]
[]
[]
["I. Other Costs"]
["Description ",null,"Computation"]
["List and describe items that will be paid with grants funds (e.g. rent, reproduction, telephone, janitorial, or security services, and investigative or confidential funds).",null,"Show the basis for computation"]
[null,null,"Quantity",null,"Basis","Cost",null,"Length of Time",null,"Total Cost","Non-Federal Contribution","Federal Request"]
[]
[{"$nulls":9},{"$f":"CEILING(C143*F143*H143,1)","v":{"v":0,"d":"$0"}},null,{"$f":"IF(J143-K143<0,0,J143-K143)","v":{"v":0,"d":"$0"}}]
["Rent",null,500,null,"sq feet",2.51,null,12,null,{"v":15060,"d":"$15,060"},{"v":0,"d":"$0"},{"v":15060,"d":"$15,060"}]
["Telephone",null,1,null,"monthly rate",50,null,12,null,{"v":600,"d":"$600"},{"v":0,"d":"$0"},{"v":600,"d":"$600"}]
["Reproduction",null,500,null,"per copy",0.05,null,12,null,{"v":300,"d":"$300"},{"v":0,"d":"$0"},{"v":300,"d":"$300"}]
["Postage",null,1000,null,"quarterly newsletter",0.5,null,4,null,{"v":2000,"d":"$2,000"},{"v":0,"d":"$0"},{"v":2000,"d":"$2,000"}]
[{"$nulls":9},{"v":0,"d":"$0"},null,{"v":0,"d":"$0"}]
["Total(s)",{"$nulls":8},{"$f":"SUM(J144:J148)","v":{"v":17960,"d":"$17,960"}},{"$f":"SUM(K148:K148)","v":{"v":0,"d":"$0"}},{"$f":"SUM(L144:L148)","v":{"v":17960,"d":"$17,960"}}]
["Narrative"]
["Rent is charged at $2.51 per square foot per month.\nTelephone is based upon $50 per month for 12 months.\nReproduction is based on 500 copies per month for 12 moths.\nPostage for mailing a quarterly newsletter for 1,000 recipients."]
[]
["J. Indirect Costs"]
["Description",null,null,"Computation"]
["Describe what the approved rate is and how it is applied.",null,null,"Compute the indirect costs for those portions of the program which allow such costs."]
[{"$nulls":3},"Base",null,"Indirect Cost Rate",{"$nulls":3},"Total Cost","Non-Federal Contribution","Federal Request"]
[]
[{"$nulls":9},{"$f":"CEILING(D158*F158,1)","v":{"v":0,"d":"$0"}},null,{"$f":"IF(J158-K158<0,0,J158-K158)","v":{"v":0,"d":"$0"}}]
["Indirect Costs",null,null,{"v":121725,"d":"$121,725"},null,{"v":0.1254,"d":"12.54%"},{"$nulls":3},{"$f":"CEILING(D159*F159,1)","v":{"v":15265,"d":"$15,265"}},{"v":0,"d":"$0"},{"$f":"IF(J159-K159<0,0,J159-K159)","v":{"v":15265,"d":"$15,265"}}]
[{"$nulls":9},{"$f":"CEILING(D160*F160,1)","v":{"v":0,"d":"$0"}},null,{"$f":"IF(J160-K160<0,0,J160-K160)","v":{"v":0,"d":"$0"}}]
["Total(s)",{"$nulls":8},{"$f":"SUM(J158:J160)","v":{"v":15265,"d":"$15,265"}},{"$f":"SUM(K158:K160)","v":{"v":0,"d":"$0"}},{"$f":"SUM(L158:L160)","v":{"v":15265,"d":"$15,265"}}]
["Narrative"]
["Indirect costs are based on Federally approved rate of 12.54% on Total Direct Labor (Personnel + Fringe)."]

{"sheet":"Definitions","index":11,"n_rows":15,"n_cols":2,"rows_kept":15,"merged":[[0,0,0,1],[1,0,1,1]]}
["Definitions"]
["Additional information can be found in the DOJ Financial Guide"]
["DOJ Financial Guide"]
["Term","Definition"]
["Match","Match is the recipient share of the project costs. Match may either be “in-kind” or “cash.” In-kind match includes the value of donated services. Cash match includes actual cash spent by the recipient and must have a cost relationship to the Federal award that is being matched. (Example: Match on administrative costs should be other administrative costs, not other matching on\nprogram costs). \n\nSample Non-Federal Match Calculation:\nMatch Calculation: If the match is 25%, the calculation is as follows:\nFederal Request:  $350,000\nDivided by .75 or 75%:  $466,667\nMultiplied by match amount .25 or 25%\nequal required match amount:  $116,667"]
["Approved Negotiated Rate","Approved Negotiated Rate is any current fringe benefits rate approved for the grant recipient by their cognizant Federal agency."]
["Expendable","An expendable item is any materials that are consumed during the course of the project such as office supplies, program supplies etc. Expendable items are usually considered to be consumed when issued and are not recorded as returnable inventory. "]
["Non-Expendable","A non-expendable item is tangible property having a useful life of more than two years and an acquisition cost of $5,000 or more per unit. (Note: Organization’s own capitalization policy may be used for items costing less than $5,000). "]
["Renovations","Costs incurred for ordinary rearrangements, alterations and restoration of facilities are considered allowable. Special arrangement and alteration costs incurred specifically for the project are allowable with the prior approval of the awarding agency."]
["Federal Acquisition Regulations","The Federal Acquisition Regulations are established for the codification and publication of uniform policies and procedures for acquisition by all executive agencies. The Federal Acquisition Regulations System consists of the Federal Acquisition Regulation (FAR), which is the primary document, and agency acquisition regulations that implement or supplement the FAR."]
["Sole Source","Procurement by noncompetitive proposals is procurement through the solicitation from only one source, or after solicitation of a number of sources, competition is determined inadequate.\n\nGrant recipients may make the initial determination that competition is not feasible if one of the following circumstances exists:\n1. The item of service is available only from a single source.\n2. The public exigency or emergency for the requirement will not permit a delay resulting from a competitive solicitation.\n3. After solicitation of a number of sources, competitions is considered inadequate."]
["Arm-Length Transaction","A transaction in which the buyers and sellers of a product act independently and have no relationship to each other. The concept of an arm's length transaction is to ensure that both parties in the deal are acting in their own self interest and are not subject to any pressure or duress from the other party.\n\nGenerally, costs of renting facilities are not allowable where one party to the rental agreement is able to control or substantially influence the actions of the other (e.g. organizations under common control through common officers. Directors or members)."]
["Confidential Funds","Confidential funds are those monies allocated to:\n\nPurchase of Services (P/S).\nThis category includes travel or transportation of a non- Federal officer or an informant; the lease of an apartment, business front, luxury-type automobiles, aircraft or boat, or similar effects to create or establish the appearance of affluence; and/or meals, beverages, entertainment, and similar expenses (including buy money and flash rolls, etc.) for undercover purposes, within reasonable limits.\n\nPurchase of Evidence (P/E).\nThis category is for P/E and/or contraband, such as narcotics and dangerous drugs, firearms, stolen property, counterfeit tax stamps, and so forth, required to determine the existence of a crime or to establish the identity of a participant in a crime.\n\nPurchase of Specific Information (P/I).\nThis category includes the payment of monies to an informant for specific information. All other informant expenses would be classified under P/S and charged accordingly. "]
["Fully Executed Negotiated Agreement","Fully Executed Negotiated Agreement is a signed, approved indirect cost rate agreement which reflects an understanding reached between the grant recipient and the cognizant Federal agency."]
["Cognizant Federal Agency","The cognizant Federal agency is the Federal agency that generally provides the most Federal financial assistance to t he recipient of funds. Cognizance is assigned by the Office of Management and Budget (OMB). Cognizant agency assignments for the largest cities and counties are published in the Federal Register."]